program: Orca
programVersion: 4.2.1
elementType: O O O O N N N C C C C C C C C C C C C C C C C C C H H H H H H H H H H H H H H H H H H H H H H H
charge: 0
multiplicity: 1
keywords: wb97x-d3
keywords: def2-TZVPP
keywords: def2/J RIJCOSX GRIDX6 NOFINALGRIDX
keywords: grid4 nofinalgrid
keywords: scfconv7
keywords: smallprint printgap noloewdin
keywords: NOSOSCF
formula: C18H23N3O4
InChI: InChI=1S/C18H23N3O4/c1-3-5-6-11-25-17(22)16(4-2)21(13-15-8-7-12-24-15)18(23)20-10-9-19-14-20/h3,7-10,12,14,16H,1,4-6,11,13H2,2H3
48 atoms
O  -1.06028 -1.118594 -0.845044
O  -2.921954 -0.042326 1.195852
O  -1.38659 -0.743945 -3.03396
O  1.350076 0.54106 -1.274781
N  -0.498156 1.435703 -0.325002
N  1.553269 1.380231 0.827491
N  2.963343 1.022203 2.482361
C  -1.262447 1.128266 -1.5297
C  -0.925573 2.039485 -2.708944
C  -1.246213 1.691881 0.907466
C  -1.214039 -0.35312 -1.91509
C  0.808032 1.080934 -0.342964
C  -1.07877 3.513457 -2.366808
C  -1.735814 0.465514 1.588071
C  -1.067214 -2.545122 -0.95282
C  0.235046 -3.098269 -0.410001
C  -1.18273 -0.326813 2.537558
C  1.424011 -2.903085 -1.352081
C  1.708529 2.585174 1.475873
C  2.352383 0.481823 1.473508
C  -2.092766 -1.407248 2.73127
C  -3.125461 -1.177625 1.887842
C  2.582114 2.333984 2.488056
C  2.720618 -3.277303 -0.708597
C  3.754847 -2.456721 -0.570971
H  -2.310724 1.313455 -1.267943
H  0.082105 1.833225 -3.067969
H  -1.598569 1.780087 -3.52636
H  -2.079894 2.348075 0.651851
H  -0.630488 2.247268 1.608952
H  -0.886778 4.131108 -3.24339
H  -2.088312 3.746473 -2.020942
H  -0.3804 3.828891 -1.591055
H  -1.23369 -2.852769 -1.986567
H  -1.908618 -2.890975 -0.349918
H  0.091481 -4.165499 -0.216033
H  0.435845 -2.639089 0.562105
H  -0.241162 -0.163573 3.037551
H  1.47751 -1.869676 -1.693917
H  1.265823 -3.517893 -2.244703
H  1.236537 3.491827 1.137084
H  2.425887 -0.548394 1.156463
H  -1.994256 -2.233418 3.415182
H  -4.047493 -1.701491 1.697004
H  2.966736 3.031906 3.21441
H  2.797346 -4.291427 -0.323883
H  4.670849 -2.770534 -0.088913
H  3.719949 -1.43799 -0.939188
totalener: -1164.99577577 hartree
nucrepener: 2418.13566896 hartree
electener: -3583.13144472 hartree
oneelecener: -6392.69956047 hartree
twoeener: 2809.56811575 hartree
kineticenergy: 1160.09164725 hartree
xcener: -111.463817959957 hartree
chargesum: -0.0000000
charge: -0.257835 -0.258726 -0.349554 -0.379597 -0.098029 0.002217 -0.295421 0.006105 -0.093077 -0.115377 0.348027 0.313146 -0.273046 0.233571 -0.066620 -0.099505 -0.263664 -0.088855 -0.161766 0.031627 -0.129420 -0.054271 -0.080934 -0.157238 -0.250233 0.087921 0.095417 0.090327 0.119539 0.140044 0.099570 0.074110 0.075346 0.122607 0.102433 0.080779 0.073898 0.153612 0.104816 0.084340 0.164881 0.132130 0.142924 0.147057 0.131087 0.101984 0.105527 0.108124
qa: -0.2578 -0.2587 -0.3496 -0.3796 -0.0980 0.0022 -0.2954 0.0061 -0.0931 -0.1154 0.3480 0.3131 -0.2730 0.2336 -0.0666 -0.0995 -0.2637 -0.0889 -0.1618 0.0316 -0.1294 -0.0543 -0.0809 -0.1572 -0.2502 0.0879 0.0954 0.0903 0.1195 0.1400 0.0996 0.0741 0.0753 0.1226 0.1024 0.0808 0.0739 0.1536 0.1048 0.0843 0.1649 0.1321 0.1429 0.1471 0.1311 0.1020 0.1055 0.1081
va: 2.1117 2.2906 2.1674 2.1160 3.0380 3.2302 3.1246 3.9628 3.8487 3.9022 4.2449 4.2823 3.9369 3.4227 3.8652 3.8250 3.9997 3.8607 3.8918 4.0425 3.9039 3.9165 4.0636 3.8002 3.9635 1.0110 1.0227 1.0240 1.0077 1.0018 1.0090 1.0019 1.0048 1.0244 1.0002 1.0172 1.0158 1.0110 1.0245 1.0121 0.9950 1.0246 1.0027 1.0004 1.0088 1.0101 1.0116 1.0144
dispcorr: -0.030800444 hartree
energy: -1165.026576209513
dipole: 1.52039 -3.08487 -1.56448 -3.24030 3.64520 0.40490 -5.69382 6.36390 0.67008
magnitude: 1.74944 au
magnitude: 4.44673 debye
