program: Orca
programVersion: 4.2.1
elementType: O O O O N N N C C C C C C C C C C C C C C C C C C H H H H H H H H H H H H H H H H H H H H H H H
charge: 0
multiplicity: 1
keywords: wb97x-d3
keywords: def2-TZVPP
keywords: def2/J RIJCOSX GRIDX6 NOFINALGRIDX
keywords: grid4 nofinalgrid
keywords: scfconv7
keywords: smallprint printgap noloewdin
keywords: NOSOSCF
formula: C18H23N3O4
InChI: InChI=1S/C18H23N3O4/c1-3-5-6-11-25-17(22)16(4-2)21(13-15-8-7-12-24-15)18(23)20-10-9-19-14-20/h3,7-10,12,14,16H,1,4-6,11,13H2,2H3
48 atoms
O  -0.26429 -1.229739 0.805192
O  -3.028661 -0.706446 -0.450052
O  -0.992503 -0.832031 2.882561
O  -0.021969 2.440341 -1.746938
N  -0.522315 1.38224 0.186826
N  1.719561 1.663411 -0.520955
N  3.664589 0.663584 -0.220293
C  -0.18765 1.009075 1.550312
C  -0.773903 1.958091 2.597511
C  -1.940589 1.440905 -0.168922
C  -0.549294 -0.449011 1.837319
C  0.333737 1.861106 -0.749965
C  -0.407193 3.409677 2.330924
C  -2.391288 0.325993 -1.044517
C  -0.496332 -2.636329 0.947995
C  -0.214176 -3.30793 -0.377666
C  -2.309268 0.109052 -2.379506
C  1.227084 -3.191023 -0.879569
C  2.688742 2.554101 -0.926383
C  2.380693 0.531434 -0.121252
C  -2.935544 -1.14943 -2.618113
C  -3.354963 -1.590882 -1.41001
C  3.8722 1.925207 -0.710302
C  2.235599 -3.715043 0.09374
C  3.31907 -3.070174 0.507954
H  0.897225 1.074895 1.660058
H  -1.857409 1.845612 2.673216
H  -0.386043 1.649431 3.568819
H  -2.148282 2.392609 -0.656044
H  -2.522553 1.427314 0.752098
H  -0.745254 4.044593 3.148909
H  0.672683 3.541195 2.240639
H  -0.862317 3.790806 1.416322
H  -1.531723 -2.804726 1.250458
H  0.149235 -3.028093 1.738143
H  -0.897496 -2.921694 -1.137785
H  -0.465637 -4.365585 -0.249978
H  -1.855243 0.767306 -3.100918
H  1.458664 -2.159023 -1.149938
H  1.298514 -3.763099 -1.810197
H  2.444153 3.525485 -1.317874
H  1.864243 -0.359445 0.195508
H  -3.064862 -1.649215 -3.563539
H  -3.887968 -2.472354 -1.094005
H  4.865049 2.307708 -0.882599
H  2.048203 -4.717425 0.473042
H  4.007787 -3.526912 1.206072
H  3.579662 -2.076996 0.160096
totalener: -1164.99890106 hartree
nucrepener: 2395.05733256 hartree
electener: -3560.05623362 hartree
oneelecener: -6346.29753830 hartree
twoeener: 2786.24130468 hartree
kineticenergy: 1160.07924430 hartree
xcener: -111.464555405088 hartree
chargesum: 0.0000000
charge: -0.271124 -0.257031 -0.333394 -0.380938 -0.084778 -0.031578 -0.319988 -0.074734 -0.113169 -0.061633 0.357720 0.329429 -0.261650 0.160519 -0.037070 -0.137617 -0.242047 -0.078076 -0.114760 0.057478 -0.117861 -0.076138 -0.077625 -0.178544 -0.224180 0.114214 0.079258 0.091052 0.136607 0.129513 0.101857 0.084697 0.082345 0.118737 0.122135 0.083264 0.076955 0.159251 0.080579 0.091118 0.158529 0.120244 0.138962 0.147853 0.130781 0.112334 0.099004 0.109501
qa: -0.2711 -0.2570 -0.3334 -0.3809 -0.0848 -0.0316 -0.3200 -0.0747 -0.1132 -0.0616 0.3577 0.3294 -0.2617 0.1605 -0.0371 -0.1376 -0.2420 -0.0781 -0.1148 0.0575 -0.1179 -0.0761 -0.0776 -0.1785 -0.2242 0.1142 0.0793 0.0911 0.1366 0.1295 0.1019 0.0847 0.0823 0.1187 0.1221 0.0833 0.0770 0.1593 0.0806 0.0911 0.1585 0.1202 0.1390 0.1479 0.1308 0.1123 0.0990 0.1095
va: 2.1121 2.2821 2.1791 2.1229 3.0222 3.2938 3.0972 4.0014 3.8943 3.8443 4.1870 4.2625 3.9451 3.5521 3.8219 3.9022 4.0249 3.8746 3.9211 3.9489 3.9064 3.9192 4.0303 3.8119 3.9415 0.9982 1.0137 1.0222 1.0095 1.0127 1.0081 1.0026 1.0062 1.0066 1.0095 1.0288 1.0134 1.0130 1.0145 1.0101 1.0089 1.0449 1.0046 1.0021 1.0061 1.0041 1.0143 1.0286
dispcorr: -0.029807022 hartree
energy: -1165.028708080942
dipole: 2.31796 -3.24445 -0.92649 -6.45471 6.33289 -0.12182 4.98583 -4.93924 0.04659
magnitude: 0.93562 au
magnitude: 2.37816 debye
