program: Orca
programVersion: 4.2.1
elementType: O O O O N N N C C C C C C C C C C C C C C C C C C H H H H H H H H H H H H H H H H H H H H H H H
charge: 0
multiplicity: 1
keywords: wb97x-d3
keywords: def2-TZVPP
keywords: def2/J RIJCOSX GRIDX6 NOFINALGRIDX
keywords: grid4 nofinalgrid
keywords: scfconv7
keywords: smallprint printgap noloewdin
keywords: NOSOSCF
formula: C18H23N3O4
InChI: InChI=1S/C18H23N3O4/c1-3-5-6-11-25-17(22)16(4-2)21(13-15-8-7-12-24-15)18(23)20-10-9-19-14-20/h3,7-10,12,14,16H,1,4-6,11,13H2,2H3
48 atoms
O  0.221014 -0.702548 0.742895
O  -3.418326 0.072862 0.083164
O  -1.286164 -0.515135 2.38662
O  0.463314 1.014188 -2.100047
N  -0.519019 1.753089 -0.177433
N  1.813289 1.76753 -0.443499
N  3.984931 1.576706 -0.116035
C  -0.47306 1.476169 1.259999
C  -1.479231 2.290691 2.062837
C  -1.826493 1.663406 -0.826255
C  -0.596944 -0.025658 1.538087
C  0.546394 1.457394 -0.983565
C  -1.298762 3.790749 1.886707
C  -2.446564 0.308506 -0.827176
C  0.20217 -2.129378 0.808949
C  1.150724 -2.649846 -0.24874
C  -2.231841 -0.808972 -1.5649
C  1.17283 -4.178197 -0.269895
C  2.193084 2.859136 0.309427
C  2.946813 1.043061 -0.676731
C  -3.130622 -1.796165 -1.065896
C  -3.819705 -1.199452 -0.065162
C  3.53149 2.715788 0.492315
C  2.08677 -4.711844 -1.325976
C  3.157817 -5.458967 -1.097577
H  0.521171 1.751556 1.621801
H  -2.501817 1.991362 1.829175
H  -1.339823 2.029316 3.11234
H  -1.709448 2.009908 -1.850837
H  -2.497077 2.369509 -0.335573
H  -2.022074 4.336593 2.491281
H  -0.305315 4.112263 2.204663
H  -1.431158 4.1095 0.852037
H  -0.815512 -2.487539 0.634349
H  0.505492 -2.458215 1.806688
H  2.160435 -2.275951 -0.060145
H  0.84739 -2.266832 -1.227527
H  -1.513369 -0.908082 -2.361017
H  0.157481 -4.549427 -0.448322
H  1.475594 -4.562182 0.708185
H  1.502998 3.635312 0.591463
H  2.927923 0.130432 -1.250911
H  -3.251441 -2.809442 -1.411149
H  -4.594785 -1.541888 0.599541
H  4.198318 3.377208 1.021871
H  1.841425 -4.441591 -2.3495
H  3.789105 -5.807991 -1.903088
H  3.446623 -5.750503 -0.094961
totalener: -1164.99762605 hartree
nucrepener: 2366.97586452 hartree
electener: -3531.97349057 hartree
oneelecener: -6290.13059448 hartree
twoeener: 2758.15710391 hartree
kineticenergy: 1160.08681149 hartree
xcener: -111.463003253230 hartree
chargesum: -0.0000000
charge: -0.255500 -0.249726 -0.324256 -0.363913 -0.132502 -0.001432 -0.301618 0.019167 -0.069949 -0.106240 0.250150 0.319774 -0.274696 0.194126 -0.041671 -0.102553 -0.249110 -0.057107 -0.188458 0.063522 -0.166684 0.003197 -0.073447 -0.179097 -0.208018 0.118709 0.077879 0.088036 0.129382 0.125891 0.104362 0.071021 0.083529 0.101858 0.117098 0.083587 0.078472 0.151665 0.079321 0.062220 0.179815 0.140155 0.141805 0.139292 0.131014 0.107103 0.103009 0.080817
qa: -0.2555 -0.2497 -0.3243 -0.3639 -0.1325 -0.0014 -0.3016 0.0192 -0.0699 -0.1062 0.2501 0.3198 -0.2747 0.1941 -0.0417 -0.1026 -0.2491 -0.0571 -0.1885 0.0635 -0.1667 0.0032 -0.0734 -0.1791 -0.2080 0.1187 0.0779 0.0880 0.1294 0.1259 0.1044 0.0710 0.0835 0.1019 0.1171 0.0836 0.0785 0.1517 0.0793 0.0622 0.1798 0.1402 0.1418 0.1393 0.1310 0.1071 0.1030 0.0808
va: 2.1284 2.3065 2.1768 2.1314 2.9887 3.2554 3.1352 3.9477 3.8594 3.9432 4.3108 4.2803 3.9349 3.4138 3.8694 3.8396 3.9754 3.8919 3.9027 4.0538 3.9127 3.9170 4.0696 3.8690 3.9777 0.9996 1.0232 1.0204 1.0115 0.9997 1.0084 1.0040 1.0062 1.0007 1.0076 1.0181 1.0187 1.0182 1.0064 1.0195 0.9906 1.0080 1.0043 1.0028 1.0089 1.0079 1.0091 1.0170
dispcorr: -0.028943821 hartree
energy: -1165.026569874389
dipole: 0.82145 -1.98435 -1.16290 -9.04340 9.14109 0.09769 3.64825 -3.26709 0.38117
magnitude: 1.22767 au
magnitude: 3.12049 debye
