program: Orca
programVersion: 4.2.1
elementType: O O O O N N N C C C C C C C C C C C C C C C C C C H H H H H H H H H H H H H H H H H H H H H H H
charge: 0
multiplicity: 1
keywords: wb97x-d3
keywords: def2-TZVPP
keywords: def2/J RIJCOSX GRIDX6 NOFINALGRIDX
keywords: grid4 nofinalgrid
keywords: scfconv7
keywords: smallprint printgap noloewdin
keywords: NOSOSCF
formula: C18H23N3O4
InChI: InChI=1S/C18H23N3O4/c1-3-5-6-11-25-17(22)16(4-2)21(13-15-8-7-12-24-15)18(23)20-10-9-19-14-20/h3,7-10,12,14,16H,1,4-6,11,13H2,2H3
48 atoms
O  -0.027051 -0.93303 0.679023
O  -3.669593 0.413602 -0.104275
O  -1.731305 -0.593576 2.088937
O  0.382364 0.803159 -2.200174
N  -0.496756 1.622023 -0.25997
N  1.820163 1.348349 -0.538376
N  3.961846 0.905691 -0.257955
C  -0.501003 1.299444 1.170755
C  -1.374166 2.244972 1.987286
C  -1.801785 1.735855 -0.909922
C  -0.860735 -0.176245 1.379714
C  0.523188 1.20841 -1.074625
C  -1.038284 2.212261 3.472604
C  -2.605346 0.480765 -0.934532
C  -0.247797 -2.345364 0.630934
C  0.805844 -2.924409 -0.287559
C  -2.491797 -0.680437 -1.626985
C  2.216284 -2.828362 0.277819
C  2.318582 2.331509 0.291843
C  2.870745 0.529746 -0.846251
C  -3.555789 -1.516552 -1.180329
C  -4.230536 -0.796052 -0.25431
C  3.634833 2.034354 0.444599
C  3.312781 -3.220155 -0.661496
C  3.175339 -3.651342 -1.909273
H  0.522717 1.405537 1.536363
H  -1.211945 3.257148 1.607212
H  -2.431587 2.015484 1.849278
H  -1.634112 2.08767 -1.925806
H  -2.366378 2.51665 -0.400195
H  0.008714 2.46423 3.651081
H  -1.644572 2.937595 4.013834
H  -1.23168 1.23497 3.909602
H  -1.253409 -2.537752 0.250418
H  -0.182423 -2.767112 1.637832
H  0.744011 -2.4134 -1.252861
H  0.553861 -3.971289 -0.476916
H  -1.73764 -0.903818 -2.362819
H  2.2900 -3.448999 1.178461
H  2.419164 -1.809282 0.621518
H  1.719315 3.15404 0.642506
H  2.758868 -0.328274 -1.491749
H  -3.788873 -2.5154 -1.509735
H  -5.094629 -1.00705 0.3529
H  4.37129 2.578153 1.014395
H  4.315436 -3.119906 -0.257833
H  4.03879 -3.900163 -2.510569
H  2.211354 -3.77565 -2.385639
totalener: -1164.99725456 hartree
nucrepener: 2409.11101355 hartree
electener: -3574.10826811 hartree
oneelecener: -6374.65068542 hartree
twoeener: 2800.54241731 hartree
kineticenergy: 1160.07783256 hartree
xcener: -111.464378639798 hartree
chargesum: -0.0000000
charge: -0.262203 -0.248547 -0.329084 -0.365841 -0.146777 0.006185 -0.304153 0.092249 -0.099462 -0.105318 0.231015 0.319892 -0.277587 0.210504 -0.051488 -0.113884 -0.280265 -0.087624 -0.179501 0.047126 -0.146683 0.000494 -0.069304 -0.170682 -0.218771 0.106339 0.078878 0.083586 0.130682 0.124635 0.073027 0.091881 0.102676 0.120472 0.111349 0.065637 0.092355 0.154922 0.084816 0.098048 0.170476 0.147523 0.145684 0.137838 0.130901 0.113252 0.105979 0.078756
qa: -0.2622 -0.2485 -0.3291 -0.3658 -0.1468 0.0062 -0.3042 0.0922 -0.0995 -0.1053 0.2310 0.3199 -0.2776 0.2105 -0.0515 -0.1139 -0.2803 -0.0876 -0.1795 0.0471 -0.1467 0.0005 -0.0693 -0.1707 -0.2188 0.1063 0.0789 0.0836 0.1307 0.1246 0.0730 0.0919 0.1027 0.1205 0.1113 0.0656 0.0924 0.1549 0.0848 0.0980 0.1705 0.1475 0.1457 0.1378 0.1309 0.1133 0.1060 0.0788
va: 2.1276 2.3120 2.1604 2.1245 3.0260 3.2489 3.0959 3.8905 3.8652 3.9308 4.2757 4.2819 3.9555 3.3924 3.9033 3.8803 3.9595 3.8363 3.8999 4.0099 3.9122 3.9291 4.0571 3.8870 3.9351 1.0075 1.0093 1.0177 1.0096 1.0009 1.0026 1.0039 1.0128 1.0004 1.0061 1.0186 1.0126 1.0172 1.0071 1.0036 0.9954 1.0093 1.0012 1.0026 1.0081 1.0081 1.0111 1.0182
dispcorr: -0.030434374 hartree
energy: -1165.027688936352
dipole: 3.21509 -4.19302 -0.97793 -7.75841 7.95346 0.19504 7.21582 -6.60416 0.61166
magnitude: 1.16984 au
magnitude: 2.97349 debye
