program: Orca
programVersion: 4.2.1
elementType: O O O O N N N C C C C C C C C C C C C C C C C C C H H H H H H H H H H H H H H H H H H H H H H H
charge: 0
multiplicity: 1
keywords: wb97x-d3
keywords: def2-TZVPP
keywords: def2/J RIJCOSX GRIDX6 NOFINALGRIDX
keywords: grid4 nofinalgrid
keywords: scfconv7
keywords: smallprint printgap noloewdin
keywords: NOSOSCF
formula: C18H23N3O4
InChI: InChI=1S/C18H23N3O4/c1-3-5-6-11-25-17(22)16(4-2)21(13-15-8-7-12-24-15)18(23)20-10-9-19-14-20/h3,7-10,12,14,16H,1,4-6,11,13H2,2H3
48 atoms
O  0.60375 -1.938934 -0.627324
O  -2.920714 2.25481 -0.907309
O  -0.353825 -2.757274 1.231509
O  -0.013917 0.924169 -2.466909
N  -0.757087 0.338775 -0.389211
N  1.373832 1.280539 -0.715147
N  3.551631 1.60251 -0.59768
C  -0.361134 -0.370852 0.822812
C  -1.343619 -0.205929 1.975684
C  -2.063989 -0.008608 -0.94158
C  -0.063104 -1.839007 0.518367
C  0.152595 0.833629 -1.279826
C  -1.461507 1.231624 2.456216
C  -3.122373 0.966382 -0.571606
C  1.13958 -3.201792 -1.028639
C  2.64581 -3.23401 -0.860813
C  -4.318118 0.83323 0.050776
C  3.146273 -3.13016 0.582666
C  1.596466 2.031248 0.417377
C  2.592252 1.071319 -1.289995
C  -4.890808 2.139726 0.100506
C  -3.992734 2.957121 -0.492819
C  2.943145 2.215321 0.463481
C  3.12872 -1.744956 1.151231
C  2.634281 -1.410575 2.337205
H  0.60012 0.022365 1.162325
H  -2.327707 -0.596774 1.709855
H  -0.990899 -0.834396 2.793978
H  -2.368932 -0.995247 -0.586094
H  -1.977058 -0.085581 -2.025561
H  -0.510746 1.593903 2.852599
H  -1.779772 1.909959 1.665457
H  -2.194408 1.305982 3.258558
H  0.875671 -3.317905 -2.080846
H  0.667996 -4.009826 -0.467494
H  3.104198 -2.449422 -1.470262
H  2.983288 -4.182188 -1.288618
H  -4.74084 -0.081322 0.433952
H  4.184671 -3.477377 0.595184
H  2.588717 -3.81409 1.22849
H  0.794845 2.393411 1.03736
H  2.699061 0.511063 -2.205234
H  -5.838783 2.425757 0.524044
H  -3.979327 4.016434 -0.68778
H  3.508192 2.768231 1.196723
H  3.605295 -0.975589 0.549078
H  2.706257 -0.395579 2.705769
H  2.152588 -2.13518 2.982684
totalener: -1164.99643004 hartree
nucrepener: 2398.78219649 hartree
electener: -3563.77862653 hartree
oneelecener: -6353.86725757 hartree
twoeener: 2790.08863104 hartree
kineticenergy: 1160.08829781 hartree
xcener: -111.468364139810 hartree
chargesum: -0.0000000
charge: -0.250912 -0.250677 -0.329974 -0.353149 -0.127163 0.015214 -0.305666 0.081016 -0.068435 -0.074844 0.238345 0.327329 -0.292198 0.193407 -0.053575 -0.121883 -0.262015 -0.066276 -0.172548 0.029240 -0.133550 -0.036003 -0.086662 -0.146914 -0.256838 0.051912 0.076486 0.094396 0.116118 0.131197 0.082298 0.095691 0.102520 0.106560 0.107801 0.075191 0.082405 0.137743 0.092578 0.077795 0.188995 0.138026 0.140152 0.141574 0.130035 0.126974 0.106389 0.101894
qa: -0.2509 -0.2507 -0.3300 -0.3531 -0.1272 0.0152 -0.3057 0.0810 -0.0684 -0.0748 0.2383 0.3273 -0.2922 0.1934 -0.0536 -0.1219 -0.2620 -0.0663 -0.1725 0.0292 -0.1336 -0.0360 -0.0867 -0.1469 -0.2568 0.0519 0.0765 0.0944 0.1161 0.1312 0.0823 0.0957 0.1025 0.1066 0.1078 0.0752 0.0824 0.1377 0.0926 0.0778 0.1890 0.1380 0.1402 0.1416 0.1300 0.1270 0.1064 0.1019
va: 2.1182 2.2987 2.1678 2.1531 3.0180 3.2429 3.0773 3.9207 3.8200 3.8906 4.2913 4.2971 3.9319 3.5283 3.8902 3.8810 3.9956 3.8643 3.8717 4.0389 3.9481 3.9157 4.0349 3.7717 3.9501 1.0396 1.0184 1.0259 1.0012 1.0320 1.0016 0.9983 1.0102 0.9979 1.0179 1.0137 1.0159 1.0111 1.0023 1.0191 0.9898 1.0115 1.0044 1.0021 1.0097 1.0212 1.0123 1.0159
dispcorr: -0.031408878 hartree
energy: -1165.027838921385
dipole: 3.54133 -4.54478 -1.00345 -9.76253 9.18140 -0.58113 13.04956 -12.37659 0.67297
magnitude: 1.34071 au
magnitude: 3.40782 debye
