program: Orca
programVersion: 4.2.1
elementType: O O O O N N N C C C C C C C C C C C C C C C C C C H H H H H H H H H H H H H H H H H H H H H H H
charge: 0
multiplicity: 1
keywords: wb97x-d3
keywords: def2-TZVPP
keywords: def2/J RIJCOSX GRIDX6 NOFINALGRIDX
keywords: grid4 nofinalgrid
keywords: scfconv7
keywords: smallprint printgap noloewdin
keywords: NOSOSCF
formula: C18H23N3O4
InChI: InChI=1S/C18H23N3O4/c1-3-5-6-11-25-17(22)16(4-2)21(13-15-8-7-12-24-15)18(23)20-10-9-19-14-20/h3,7-10,12,14,16H,1,4-6,11,13H2,2H3
48 atoms
O  0.086355 -0.871637 0.956593
O  -3.488702 0.230893 -0.146623
O  -1.673715 -0.409897 2.257207
O  0.676632 0.571797 -2.099997
N  -0.392895 1.530701 -0.328034
N  1.941919 1.343472 -0.380724
N  3.579963 2.437714 0.612784
C  -0.490453 1.392934 1.127698
C  -1.453765 2.395167 1.754621
C  -1.650844 1.515062 -1.074755
C  -0.800943 -0.058426 1.515431
C  0.705065 1.089003 -1.011558
C  -1.204839 2.589576 3.244583
C  -2.421508 0.244161 -0.976531
C  -0.0124 -2.273231 1.228665
C  1.115959 -2.960082 0.490197
C  -2.266171 -0.979836 -1.53966
C  0.946437 -2.952018 -1.029962
C  3.053526 0.537763 -0.461841
C  2.332975 2.483373 0.27124
C  -3.302324 -1.79965 -1.005951
C  -4.006855 -1.006533 -0.165137
C  4.039315 1.224792 0.171341
C  2.161727 -3.448801 -1.745308
C  2.810108 -2.765732 -2.680639
H  0.497887 1.591822 1.546632
H  -1.315024 3.351711 1.243485
H  -2.489276 2.093071 1.594936
H  -1.41949 1.725604 -2.116434
H  -2.26567 2.341931 -0.718178
H  -0.1854 2.928298 3.437932
H  -1.880345 3.344349 3.645505
H  -1.370972 1.672478 3.805756
H  -0.989262 -2.641371 0.903855
H  0.066334 -2.44012 2.305472
H  1.170555 -3.992102 0.848098
H  2.064003 -2.491869 0.769249
H  -1.502536 -1.257128 -2.246744
H  0.711867 -1.947287 -1.382742
H  0.085684 -3.57976 -1.287525
H  3.032344 -0.428681 -0.936331
H  1.662426 3.315505 0.425491
H  -3.499199 -2.83563 -1.225907
H  -4.86675 -1.179858 0.45977
H  5.058948 0.915644 0.334561
H  2.526818 -4.432505 -1.460841
H  3.690984 -3.162648 -3.166863
H  2.478762 -1.782674 -2.99621
totalener: -1164.99792365 hartree
nucrepener: 2420.80631994 hartree
electener: -3585.80424360 hartree
oneelecener: -6397.90925649 hartree
twoeener: 2812.10501289 hartree
kineticenergy: 1160.07415182 hartree
xcener: -111.461183339872 hartree
chargesum: -0.0000000
charge: -0.254572 -0.248514 -0.331004 -0.370629 -0.134069 0.014103 -0.289028 0.081348 -0.092934 -0.097917 0.233356 0.309431 -0.279775 0.206764 -0.037165 -0.132996 -0.274592 -0.040637 -0.104091 -0.006413 -0.149845 0.001818 -0.086824 -0.168944 -0.231518 0.105064 0.078550 0.084403 0.130445 0.126788 0.076880 0.091114 0.101920 0.100212 0.114911 0.083135 0.081823 0.157438 0.051514 0.086399 0.137733 0.154728 0.141668 0.137909 0.133386 0.103572 0.102035 0.103017
qa: -0.2546 -0.2485 -0.3310 -0.3706 -0.1341 0.0141 -0.2890 0.0813 -0.0929 -0.0979 0.2334 0.3094 -0.2798 0.2068 -0.0372 -0.1330 -0.2746 -0.0406 -0.1041 -0.0064 -0.1498 0.0018 -0.0868 -0.1689 -0.2315 0.1051 0.0786 0.0844 0.1304 0.1268 0.0769 0.0911 0.1019 0.1002 0.1149 0.0831 0.0818 0.1574 0.0515 0.0864 0.1377 0.1547 0.1417 0.1379 0.1334 0.1036 0.1020 0.1030
va: 2.1318 2.3119 2.1558 2.1141 3.0353 3.2379 3.1441 3.9291 3.8562 3.9155 4.2563 4.2769 3.9584 3.4056 3.8908 3.8792 3.9717 3.8538 3.9258 4.0537 3.9116 3.9282 4.0551 3.8488 3.9533 1.0094 1.0095 1.0186 1.0135 1.0006 1.0020 1.0041 1.0125 0.9992 1.0079 1.0178 1.0188 1.0075 1.0303 1.0097 1.0238 0.9982 1.0036 1.0027 1.0079 1.0102 1.0136 1.0175
dispcorr: -0.031317533 hartree
energy: -1165.029241187513
dipole: 1.31185 -2.21751 -0.90566 -8.34808 7.68774 -0.66033 3.85932 -3.66187 0.19744
magnitude: 1.13809 au
magnitude: 2.89280 debye
