program: Orca
programVersion: 4.2.1
elementType: O O O O N N N C C C C C C C C C C C C C C C C C C H H H H H H H H H H H H H H H H H H H H H H H
charge: 0
multiplicity: 1
keywords: wb97x-d3
keywords: def2-TZVPP
keywords: def2/J RIJCOSX GRIDX6 NOFINALGRIDX
keywords: grid4 nofinalgrid
keywords: scfconv7
keywords: smallprint printgap noloewdin
keywords: NOSOSCF
formula: C18H23N3O4
InChI: InChI=1S/C18H23N3O4/c1-3-5-6-11-25-17(22)16(4-2)21(13-15-8-7-12-24-15)18(23)20-10-9-19-14-20/h3,7-10,12,14,16H,1,4-6,11,13H2,2H3
48 atoms
O  -0.106337 -1.025321 1.234556
O  -2.783585 -0.886403 -0.336267
O  -1.043624 -0.25261 3.111704
O  0.016394 2.276426 -1.92184
N  -0.439068 1.429231 0.12439
N  1.784678 1.784566 -0.591028
N  3.896617 2.408453 -0.72943
C  -0.103912 1.314042 1.53389
C  -0.69118 2.441163 2.384441
C  -1.854923 1.35065 -0.239548
C  -0.49122 -0.065492 2.064825
C  0.395059 1.850458 -0.858344
C  -0.283441 3.816717 1.879268
C  -2.206173 0.130237 -1.014936
C  -0.438294 -2.375813 1.579011
C  -0.004671 -3.280017 0.446948
C  -2.071059 -0.207303 -2.320137
C  1.501116 -3.336751 0.239653
C  2.532719 0.768631 -0.031637
C  2.675105 2.733147 -1.010605
C  -2.595515 -1.526882 -2.447806
C  -3.01459 -1.881886 -1.211905
C  3.82331 1.181234 -0.130183
C  1.96568 -4.305189 -0.803025
C  1.203969 -5.069736 -1.574173
H  0.981695 1.386386 1.632153
H  -1.77904 2.365852 2.443875
H  -0.336083 2.301148 3.406378
H  -2.133396 2.238253 -0.807196
H  -2.441755 1.370517 0.678932
H  0.801368 3.913702 1.805079
H  -0.703771 4.038363 0.897689
H  -0.632771 4.591594 2.560613
H  -1.514558 -2.451519 1.743678
H  0.05816 -2.648316 2.514857
H  -0.505227 -2.975601 -0.475892
H  -0.374749 -4.281789 0.684367
H  -1.646354 0.409563 -3.093784
H  1.993729 -3.585229 1.187142
H  1.881311 -2.34689 -0.031254
H  2.092623 -0.143191 0.33074
H  2.352304 3.636747 -1.503026
H  -2.657465 -2.123086 -3.342592
H  -3.490983 -2.766883 -0.823397
H  4.708184 0.654863 0.190069
H  3.043086 -4.362287 -0.924202
H  1.642315 -5.734954 -2.30514
H  0.123064 -5.06574 -1.521084
totalener: -1164.99771363 hartree
nucrepener: 2363.28613836 hartree
electener: -3528.28385199 hartree
oneelecener: -6282.36630432 hartree
twoeener: 2754.08245233 hartree
kineticenergy: 1160.07991164 hartree
xcener: -111.463454038958 hartree
chargesum: -0.0000000
charge: -0.270063 -0.260405 -0.330991 -0.377616 -0.085294 -0.027039 -0.295536 -0.072220 -0.100475 -0.058314 0.347927 0.317015 -0.265654 0.159103 -0.044667 -0.099143 -0.239288 -0.042414 -0.160579 0.055619 -0.111399 -0.076830 -0.079145 -0.164960 -0.218029 0.112988 0.076829 0.087685 0.138619 0.123302 0.086119 0.082771 0.102545 0.117473 0.113713 0.072110 0.074673 0.161651 0.068784 0.077224 0.158735 0.144979 0.138987 0.147364 0.131543 0.103457 0.105232 0.073615
qa: -0.2701 -0.2604 -0.3310 -0.3776 -0.0853 -0.0270 -0.2955 -0.0722 -0.1005 -0.0583 0.3479 0.3170 -0.2657 0.1591 -0.0447 -0.0991 -0.2393 -0.0424 -0.1606 0.0556 -0.1114 -0.0768 -0.0791 -0.1650 -0.2180 0.1130 0.0768 0.0877 0.1386 0.1233 0.0861 0.0828 0.1025 0.1175 0.1137 0.0721 0.0747 0.1617 0.0688 0.0772 0.1587 0.1450 0.1390 0.1474 0.1315 0.1035 0.1052 0.0736
va: 2.1174 2.2797 2.1809 2.1240 2.9977 3.2663 3.1416 4.0010 3.8920 3.8444 4.2054 4.2893 3.9422 3.5451 3.8749 3.9081 4.0302 3.8532 3.8711 4.0384 3.9165 3.9179 4.0734 3.9104 3.9466 1.0000 1.0152 1.0218 1.0073 1.0181 1.0030 1.0062 1.0083 1.0067 1.0075 1.0137 1.0118 1.0119 1.0083 1.0079 1.0212 1.0083 1.0043 1.0021 1.0105 1.0078 1.0103 1.0186
dispcorr: -0.028548032 hartree
energy: -1165.026261665598
dipole: 0.31798 -1.21792 -0.89994 -10.28141 9.35736 -0.92405 4.71230 -4.14228 0.57002
magnitude: 1.41021 au
magnitude: 3.58446 debye
