program: Orca
programVersion: 4.2.1
elementType: O O O O N N N C C C C C C C C C C C C C C C C C C H H H H H H H H H H H H H H H H H H H H H H H
charge: 0
multiplicity: 1
keywords: wb97x-d3
keywords: def2-TZVPP
keywords: def2/J RIJCOSX GRIDX6 NOFINALGRIDX
keywords: grid4 nofinalgrid
keywords: scfconv7
keywords: smallprint printgap noloewdin
keywords: NOSOSCF
formula: C18H23N3O4
InChI: InChI=1S/C18H23N3O4/c1-3-5-6-11-25-17(22)16(4-2)21(13-15-8-7-12-24-15)18(23)20-10-9-19-14-20/h3,7-10,12,14,16H,1,4-6,11,13H2,2H3
48 atoms
O  -0.038776 -0.906616 0.549232
O  -3.71702 0.45437 -0.12882
O  -1.736257 -0.617358 1.978628
O  0.301419 0.964672 -2.286221
N  -0.553069 1.688733 -0.29786
N  1.760462 1.454093 -0.62592
N  3.912186 1.020676 -0.412201
C  -0.523758 1.310641 1.118766
C  -1.38567 2.217703 1.988972
C  -1.871456 1.817618 -0.917241
C  -0.871027 -0.173913 1.278634
C  0.455537 1.323618 -1.146721
C  -1.022696 2.126719 3.465407
C  -2.666359 0.558282 -0.972094
C  -0.257919 -2.318808 0.482582
C  0.844941 -2.916278 -0.362383
C  -2.553602 -0.577864 -1.704973
C  2.230093 -2.835107 0.282497
C  2.269932 2.40884 0.22983
C  2.810152 0.658634 -0.987272
C  -3.603878 -1.437631 -1.270873
C  -4.27025 -0.754367 -0.311234
C  3.591903 2.117575 0.341815
C  3.293733 -3.386994 -0.61083
C  4.012252 -4.473159 -0.362638
H  0.50684 1.409618 1.466007
H  -1.234787 3.245282 1.647236
H  -2.444366 1.98855 1.860879
H  -1.725796 2.207594 -1.922573
H  -2.430764 2.575391 -0.368293
H  0.026472 2.375422 3.635284
H  -1.621602 2.827358 4.045989
H  -1.205367 1.132064 3.866397
H  -1.23977 -2.505604 0.041354
H  -0.25757 -2.743515 1.49011
H  0.849698 -2.433001 -1.344442
H  0.596773 -3.965363 -0.542575
H  -1.809184 -0.769636 -2.45948
H  2.222353 -3.379445 1.231115
H  2.468462 -1.794565 0.521403
H  1.671662 3.210717 0.626954
H  2.685795 -0.170336 -1.665912
H  -3.833467 -2.42707 -1.629709
H  -5.123162 -0.993206 0.301453
H  4.336845 2.644653 0.916135
H  3.467202 -2.844994 -1.537041
H  4.763403 -4.827916 -1.054873
H  3.878176 -5.049577 0.544838
totalener: -1164.99723065 hartree
nucrepener: 2389.02746729 hartree
electener: -3554.02469793 hartree
oneelecener: -6334.36575567 hartree
twoeener: 2780.34105774 hartree
kineticenergy: 1160.08188565 hartree
xcener: -111.461388494905 hartree
chargesum: 0.0000000
charge: -0.262850 -0.248759 -0.329724 -0.367639 -0.148379 0.003840 -0.298662 0.093590 -0.099641 -0.104818 0.231720 0.324640 -0.277206 0.212626 -0.042267 -0.115831 -0.284851 -0.101797 -0.179082 0.046087 -0.142050 -0.000317 -0.067725 -0.140108 -0.219174 0.106458 0.079024 0.083776 0.130292 0.124768 0.073345 0.091912 0.102585 0.116555 0.110153 0.073906 0.086754 0.154710 0.070878 0.110113 0.171093 0.138031 0.146187 0.137637 0.131664 0.098492 0.102019 0.078025
qa: -0.2628 -0.2488 -0.3297 -0.3676 -0.1484 0.0038 -0.2987 0.0936 -0.0996 -0.1048 0.2317 0.3246 -0.2772 0.2126 -0.0423 -0.1158 -0.2849 -0.1018 -0.1791 0.0461 -0.1421 -0.0003 -0.0677 -0.1401 -0.2192 0.1065 0.0790 0.0838 0.1303 0.1248 0.0733 0.0919 0.1026 0.1166 0.1102 0.0739 0.0868 0.1547 0.0709 0.1101 0.1711 0.1380 0.1462 0.1376 0.1317 0.0985 0.1020 0.0780
va: 2.1302 2.3129 2.1589 2.1235 3.0282 3.2545 3.0955 3.8895 3.8645 3.9279 4.2706 4.2825 3.9555 3.3907 3.8749 3.8553 3.9581 3.8557 3.8992 4.0247 3.9105 3.9300 4.0541 3.8550 3.9934 1.0079 1.0092 1.0177 1.0098 1.0010 1.0025 1.0039 1.0128 1.0013 1.0074 1.0236 1.0231 1.0185 1.0205 1.0089 0.9951 1.0093 1.0008 1.0027 1.0076 1.0116 1.0087 1.0175
dispcorr: -0.029660475 hartree
energy: -1165.026891121154
dipole: 4.27844 -5.32536 -1.04692 -9.26707 9.48992 0.22285 9.10732 -8.52905 0.57827
magnitude: 1.21659 au
magnitude: 3.09233 debye
