program: Orca
programVersion: 4.2.1
elementType: Cl F F F O N N N C C C C C C C C C C C C C C C H H H H H H H H H H H H H H H
charge: 0
multiplicity: 1
keywords: wb97x-d3
keywords: def2-TZVPP
keywords: def2/J RIJCOSX GRIDX6 NOFINALGRIDX
keywords: grid4 nofinalgrid
keywords: scfconv7
keywords: smallprint printgap noloewdin
keywords: NOSOSCF
formula: C15H15ClF3N3O
InChI: InChI=1S/C15H15ClF3N3O/c1-2-7-23-9-14(22-6-5-20-10-22)21-13-4-3-11(16)8-12(13)15(17,18)19/h3-6,8,10H,2,7,9H2,1H3
38 atoms
Cl -4.935306 1.736802 0.340858
F  -2.68057 -2.801998 -0.594636
F  -0.697526 -2.279366 -1.233326
F  -1.05502 -2.867675 0.804154
O  2.220422 1.232487 -1.927912
N  2.694832 -0.823024 0.099946
N  0.532217 -0.44894 0.68472
N  4.321695 -1.694763 1.311351
C  1.430557 -0.313656 -0.196694
C  1.249152 0.290579 -1.57267
C  2.064026 2.527579 -1.368525
C  -0.747971 0.072385 0.534143
C  2.714176 2.705215 -0.006291
C  -1.820021 -0.74015 0.146652
C  -1.002107 1.400783 0.865935
C  -3.107351 -0.224658 0.085644
C  3.775577 -0.983918 -0.747748
C  2.668271 4.165755 0.418953
C  3.096917 -1.272255 1.32968
C  -1.56766 -2.170946 -0.215265
C  -2.282373 1.919471 0.804749
C  -3.328561 1.100481 0.41507
C  4.75341 -1.52535 0.015218
H  0.241052 0.710633 -1.643902
H  1.303311 -0.521979 -2.302844
H  1.000734 2.797024 -1.325254
H  2.532963 3.213119 -2.078078
H  2.216946 2.096752 0.754176
H  3.750965 2.363484 -0.054225
H  -0.186279 2.033831 1.189239
H  -3.938822 -0.844942 -0.217639
H  3.761473 -0.72339 -1.790116
H  1.642555 4.535044 0.476428
H  3.121311 4.303848 1.400025
H  3.208162 4.800057 -0.286045
H  2.446686 -1.25563 2.187912
H  -2.455837 2.954998 1.062346
H  5.7485 -1.801446 -0.293146
elementType: Cl F O N C H
totalener: -1579.96592721 hartree
nucrepener: 2167.44532327 hartree
electener: -3747.41125049 hartree
oneelecener: -6476.30595410 hartree
twoeener: 2728.89470362 hartree
cpcmener: -0.02603547 hartree
kineticenergy: 1574.91559749 hartree
xcener: -123.748953744805 hartree
chargesum: 0.0000000
charge: -0.089032 -0.176726 -0.181846 -0.176164 -0.383956 0.001509 -0.291549 -0.380897 0.139661 0.039690 0.024595 0.087530 -0.114661 -0.119411 -0.220899 -0.080896 -0.132525 -0.267744 0.069746 0.555887 -0.110550 0.083412 -0.114283 0.134004 0.144526 0.081913 0.109734 0.061564 0.075765 0.172664 0.134333 0.175284 0.081720 0.096393 0.088399 0.164188 0.148811 0.169815
qa: -0.0890 -0.1767 -0.1818 -0.1762 -0.3840 0.0015 -0.2915 -0.3809 0.1397 0.0397 0.0246 0.0875 -0.1147 -0.1194 -0.2209 -0.0809 -0.1325 -0.2677 0.0697 0.5559 -0.1105 0.0834 -0.1143 0.1340 0.1445 0.0819 0.1097 0.0616 0.0758 0.1727 0.1343 0.1753 0.0817 0.0964 0.0884 0.1642 0.1488 0.1698
va: 1.2137 1.1279 1.1126 1.1230 1.9219 3.2979 2.9542 3.1146 3.8224 3.9360 3.8902 3.9720 3.8557 3.8117 3.9806 3.9823 3.9152 3.9523 4.0169 4.4287 4.0277 3.8562 4.0231 0.9989 0.9897 0.9977 0.9979 1.0080 1.0149 0.9830 1.0239 1.0044 1.0026 1.0022 1.0018 1.0153 1.0031 0.9991
dispcorr: -0.020624048 hartree
energy: -1579.986551261160
dipole: 33.64846 -34.18800 -0.53954 28.25703 -25.99802 2.25901 -2.10230 0.99003 -1.11227
magnitude: 2.57515 au
magnitude: 6.54551 debye
