program: Orca
programVersion: 4.2.1
elementType: Cl F F F O N N N C C C C C C C C C C C C C C C H H H H H H H H H H H H H H H
charge: 0
multiplicity: 1
keywords: wb97x-d3
keywords: def2-TZVPP
keywords: def2/J RIJCOSX GRIDX6 NOFINALGRIDX
keywords: grid4 nofinalgrid
keywords: scfconv7
keywords: smallprint printgap noloewdin
keywords: NOSOSCF
formula: C15H15ClF3N3O
InChI: InChI=1S/C15H15ClF3N3O/c1-2-7-23-9-14(22-6-5-20-10-22)21-13-4-3-11(16)8-12(13)15(17,18)19/h3-6,8,10H,2,7,9H2,1H3
38 atoms
Cl -4.504352 2.000086 -0.552033
F  -0.158126 -1.626914 1.72356
F  -2.258158 -2.057505 1.673246
F  -0.981426 -2.786837 0.111213
O  1.412154 1.962456 0.41258
N  2.969803 -1.047897 -0.958977
N  0.757876 -0.636192 -0.773986
N  4.992751 -1.80964 -1.412939
C  1.922355 -0.160364 -0.676201
C  2.358972 1.245748 -0.310081
C  1.414838 1.680387 1.803861
C  -0.436158 0.052092 -0.674468
C  0.548114 2.689408 2.52405
C  -1.460899 -0.481869 0.1176
C  -0.719071 1.167389 -1.462857
C  -2.709811 0.123047 0.161529
C  2.830669 -2.392623 -1.239978
C  -0.924482 2.622413 2.150934
C  4.302107 -0.761924 -1.084527
C  -1.213006 -1.732823 0.90377
C  -1.964384 1.762282 -1.436124
C  -2.950013 1.243396 -0.611101
C  4.081252 -2.835911 -1.507526
H  2.56684 1.784329 -1.240283
H  3.303897 1.192253 0.241907
H  2.441442 1.732538 2.187735
H  1.050936 0.663941 1.9966
H  0.664255 2.502008 3.594187
H  0.94117 3.694295 2.346613
H  0.041076 1.563949 -2.122489
H  -3.4983 -0.273774 0.78484
H  1.878535 -2.891096 -1.206905
H  -1.337486 1.634246 2.358019
H  -1.503861 3.346306 2.724921
H  -1.089606 2.833619 1.094929
H  4.71244 0.223602 -0.939478
H  -2.160214 2.628395 -2.053209
H  4.384242 -3.838984 -1.760313
elementType: Cl F O N C H
totalener: -1579.96579964 hartree
nucrepener: 2205.86421218 hartree
electener: -3785.83001182 hartree
oneelecener: -6553.77575324 hartree
twoeener: 2767.94574142 hartree
cpcmener: -0.02899581 hartree
kineticenergy: 1574.92504435 hartree
xcener: -123.754239847749 hartree
chargesum: -0.0000000
charge: -0.094032 -0.179190 -0.182320 -0.177233 -0.358827 -0.041851 -0.336724 -0.386816 0.271451 -0.029956 -0.002042 0.223275 -0.093157 -0.200581 -0.201708 -0.101013 -0.125079 -0.269618 0.066250 0.554688 -0.131348 0.102508 -0.123015 0.165980 0.117535 0.104850 0.093610 0.067074 0.061670 0.148771 0.130175 0.184118 0.076668 0.102490 0.082201 0.167397 0.144337 0.169463
qa: -0.0940 -0.1792 -0.1823 -0.1772 -0.3588 -0.0419 -0.3367 -0.3868 0.2715 -0.0300 -0.0020 0.2233 -0.0932 -0.2006 -0.2017 -0.1010 -0.1251 -0.2696 0.0663 0.5547 -0.1313 0.1025 -0.1230 0.1660 0.1175 0.1049 0.0936 0.0671 0.0617 0.1488 0.1302 0.1841 0.0767 0.1025 0.0822 0.1674 0.1443 0.1695
va: 1.2092 1.1093 1.1179 1.1191 1.9422 3.3552 3.0043 3.1096 3.7870 3.9727 3.8574 3.7650 3.9254 3.7847 4.0093 3.9305 3.9079 3.9223 4.0466 4.4197 3.9702 3.7986 4.0477 0.9787 0.9997 1.0027 0.9980 1.0114 1.0152 0.9992 1.0258 1.0036 1.0023 1.0064 1.0068 0.9944 1.0044 0.9998
dispcorr: -0.021737238 hartree
energy: -1579.987536880181
dipole: 21.06464 -20.64856 0.41608 19.13456 -17.35471 1.77986 4.94605 -4.79250 0.15355
magnitude: 1.83428 au
magnitude: 4.66238 debye
