program: Orca
programVersion: 4.2.1
elementType: Cl F F F O N N N C C C C C C C C C C C C C C C H H H H H H H H H H H H H H H
charge: 0
multiplicity: 1
keywords: wb97x-d3
keywords: def2-TZVPP
keywords: def2/J RIJCOSX GRIDX6 NOFINALGRIDX
keywords: grid4 nofinalgrid
keywords: scfconv7
keywords: smallprint printgap noloewdin
keywords: NOSOSCF
formula: C15H15ClF3N3O
InChI: InChI=1S/C15H15ClF3N3O/c1-2-7-23-9-14(22-6-5-20-10-22)21-13-4-3-11(16)8-12(13)15(17,18)19/h3-6,8,10H,2,7,9H2,1H3
38 atoms
Cl -5.328694 1.244155 -0.425841
F  -2.070072 -1.772851 2.183512
F  -0.815673 -2.624244 0.665294
F  -0.14092 -0.918617 1.788185
O  2.346884 1.998805 0.156054
N  2.491654 -0.469251 -1.248968
N  0.234875 -0.59405 -1.085709
N  4.615521 -0.747731 -1.782731
C  1.260973 0.14193 -0.998072
C  1.276707 1.618795 -0.656739
C  2.288859 1.485933 1.476758
C  -1.051522 -0.106406 -0.892248
C  3.531337 1.920956 2.221693
C  -1.824051 -0.548412 0.188707
C  -1.634982 0.746986 -1.825722
C  -3.136832 -0.123801 0.334796
C  2.704939 -1.832878 -1.319547
C  3.527339 1.408084 3.653285
C  3.690106 0.12743 -1.538758
C  -1.21606 -1.467233 1.20323
C  -2.945345 1.167234 -1.688684
C  -3.687861 0.729065 -0.605709
C  4.011249 -1.976328 -1.640872
H  0.313696 1.876017 -0.20053
H  1.353333 2.189761 -1.58629
H  2.235864 0.389736 1.469367
H  1.385405 1.851393 1.982362
H  4.413072 1.545512 1.695552
H  3.596654 3.011791 2.219105
H  -1.058183 1.075889 -2.680069
H  -3.735414 -0.449705 1.173393
H  1.926532 -2.547819 -1.121357
H  3.481264 0.318398 3.68844
H  4.431104 1.714244 4.179323
H  2.674519 1.793671 4.21416
H  3.822831 1.19354 -1.586777
H  -3.376848 1.830196 -2.425596
H  4.558078 -2.895423 -1.774015
elementType: Cl F O N C H
totalener: -1579.96923353 hartree
nucrepener: 2154.07344126 hartree
electener: -3734.04267479 hartree
oneelecener: -6449.76549902 hartree
twoeener: 2715.72282423 hartree
cpcmener: -0.02682491 hartree
kineticenergy: 1574.91984768 hartree
xcener: -123.748314825296 hartree
chargesum: 0.0000000
charge: -0.088979 -0.178424 -0.175940 -0.175721 -0.382326 -0.030778 -0.305763 -0.384627 0.190556 0.024571 0.006321 0.097902 -0.072315 -0.166216 -0.162292 -0.080415 -0.128367 -0.279600 0.071858 0.550186 -0.113676 0.085174 -0.118153 0.128859 0.158925 0.081284 0.102635 0.062007 0.064607 0.161055 0.133673 0.180369 0.081857 0.095066 0.083115 0.164616 0.149877 0.169084
qa: -0.0890 -0.1784 -0.1759 -0.1757 -0.3823 -0.0308 -0.3058 -0.3846 0.1906 0.0246 0.0063 0.0979 -0.0723 -0.1662 -0.1623 -0.0804 -0.1284 -0.2796 0.0719 0.5502 -0.1137 0.0852 -0.1182 0.1289 0.1589 0.0813 0.1026 0.0620 0.0646 0.1611 0.1337 0.1804 0.0819 0.0951 0.0831 0.1646 0.1499 0.1691
va: 1.2144 1.1245 1.1224 1.1126 1.9273 3.3094 3.0054 3.1077 3.8359 3.9314 3.8904 3.9373 3.8935 3.8500 3.9864 3.9762 3.9095 3.9540 4.0322 4.4243 3.9905 3.8543 4.0433 0.9958 0.9808 0.9889 0.9969 1.0119 1.0116 0.9944 1.0241 1.0052 1.0007 1.0031 1.0015 1.0104 1.0013 0.9994
dispcorr: -0.019206643 hartree
energy: -1579.988440173487
dipole: 34.39248 -35.47719 -1.08471 15.30930 -13.90603 1.40326 4.87067 -4.95309 -0.08242
magnitude: 1.77554 au
magnitude: 4.51306 debye
