program: Orca
programVersion: 4.2.1
elementType: Cl F F F O N N N C C C C C C C C C C C C C C C H H H H H H H H H H H H H H H
charge: 0
multiplicity: 1
keywords: wb97x-d3
keywords: def2-TZVPP
keywords: def2/J RIJCOSX GRIDX6 NOFINALGRIDX
keywords: grid4 nofinalgrid
keywords: scfconv7
keywords: smallprint printgap noloewdin
keywords: NOSOSCF
formula: C15H15ClF3N3O
InChI: InChI=1S/C15H15ClF3N3O/c1-2-7-23-9-14(22-6-5-20-10-22)21-13-4-3-11(16)8-12(13)15(17,18)19/h3-6,8,10H,2,7,9H2,1H3
38 atoms
Cl -4.919972 1.656057 -0.415031
F  -1.829797 -1.44221 2.307613
F  -0.78725 -2.582332 0.81732
F  0.146364 -0.858678 1.701281
O  2.480089 1.011794 0.637736
N  2.601575 -1.073803 -1.234269
N  0.337711 -0.890578 -1.227426
N  3.853612 -2.847508 -1.62681
C  1.446459 -0.326205 -0.999716
C  1.655793 1.074418 -0.494729
C  2.560941 2.239441 1.343753
C  -0.874794 -0.246608 -0.998674
C  1.373851 2.484736 2.260213
C  -1.601385 -0.468386 0.176798
C  -1.425443 0.567151 -1.984437
C  -2.845366 0.121333 0.355128
C  3.899629 -0.618272 -1.35908
C  1.538199 3.791607 3.02126
C  2.645956 -2.429693 -1.40791
C  -1.02224 -1.338341 1.249577
C  -2.66496 1.155723 -1.811458
C  -3.367526 0.927695 -0.640312
C  4.644514 -1.721331 -1.606845
H  0.680933 1.519418 -0.277382
H  2.102609 1.681822 -1.294897
H  2.682042 3.07604 0.643315
H  3.476502 2.184838 1.936726
H  0.443762 2.515546 1.686059
H  1.284505 1.652231 2.961808
H  -0.876786 0.734622 -2.901372
H  -3.410287 -0.038703 1.262413
H  4.176755 0.417868 -1.283357
H  2.449938 3.79191 3.621301
H  1.589394 4.645302 2.343427
H  0.70077 3.960457 3.697729
H  1.763572 -3.044104 -1.342831
H  -3.073202 1.787062 -2.588368
H  5.70845 -1.770576 -1.771741
elementType: Cl F O N C H
totalener: -1579.96619289 hartree
nucrepener: 2166.39063379 hartree
electener: -3746.35682668 hartree
oneelecener: -6474.83010645 hartree
twoeener: 2728.47327977 hartree
cpcmener: -0.02991749 hartree
kineticenergy: 1574.92428004 hartree
xcener: -123.747882998485 hartree
chargesum: -0.0000000
charge: -0.089128 -0.177896 -0.176442 -0.176139 -0.371276 -0.022466 -0.300286 -0.385746 0.222142 -0.001642 0.021859 0.080333 -0.067529 -0.173331 -0.156498 -0.091914 -0.122667 -0.279415 0.072287 0.565806 -0.112445 0.089652 -0.127826 0.128024 0.154686 0.077787 0.101038 0.049905 0.058272 0.153896 0.133281 0.179507 0.082990 0.083687 0.094149 0.163756 0.150031 0.169557
qa: -0.0891 -0.1779 -0.1764 -0.1761 -0.3713 -0.0225 -0.3003 -0.3857 0.2221 -0.0016 0.0219 0.0803 -0.0675 -0.1733 -0.1565 -0.0919 -0.1227 -0.2794 0.0723 0.5658 -0.1124 0.0897 -0.1278 0.1280 0.1547 0.0778 0.1010 0.0499 0.0583 0.1539 0.1333 0.1795 0.0830 0.0837 0.0941 0.1638 0.1500 0.1696
va: 1.2139 1.1259 1.1212 1.1166 1.9301 3.3179 3.0182 3.1140 3.9247 3.9539 3.9268 3.9670 3.8520 3.8351 3.9764 3.9859 3.9345 3.9620 4.0218 4.3995 3.9860 3.8465 4.0336 0.9889 0.9866 0.9962 0.9947 1.0143 1.0169 1.0000 1.0247 0.9950 1.0014 1.0011 1.0018 1.0128 1.0008 0.9993
dispcorr: -0.018949494 hartree
energy: -1579.985142388063
dipole: 27.30515 -27.55324 -0.24809 23.95634 -20.60064 3.35570 2.29748 -2.81019 -0.51272
magnitude: 3.40370 au
magnitude: 8.65152 debye
