program: Orca
programVersion: 4.2.1
elementType: Cl F F F O N N N C C C C C C C C C C C C C C C H H H H H H H H H H H H H H H
charge: 0
multiplicity: 1
keywords: wb97x-d3
keywords: def2-TZVPP
keywords: def2/J RIJCOSX GRIDX6 NOFINALGRIDX
keywords: grid4 nofinalgrid
keywords: scfconv7
keywords: smallprint printgap noloewdin
keywords: NOSOSCF
formula: C15H15ClF3N3O
InChI: InChI=1S/C15H15ClF3N3O/c1-2-7-23-9-14(22-6-5-20-10-22)21-13-4-3-11(16)8-12(13)15(17,18)19/h3-6,8,10H,2,7,9H2,1H3
38 atoms
Cl -5.288467 1.265958 -0.487733
F  -0.905154 -2.776694 0.468093
F  -0.1656 -1.137057 1.647372
F  -2.121877 -1.939807 2.025695
O  2.209384 1.221786 0.857354
N  2.487717 -0.719737 -1.118576
N  0.22065 -0.709329 -1.195576
N  4.640611 -1.013496 -1.501483
C  1.27026 -0.084607 -0.869277
C  1.347227 1.281015 -0.243466
C  2.435114 2.49422 1.435696
C  -1.050118 -0.186836 -0.980563
C  3.491468 2.377261 2.512539
C  -1.842632 -0.651546 0.074944
C  -1.590456 0.738891 -1.868447
C  -3.14521 -0.199038 0.22786
C  2.654291 -2.058652 -1.412105
C  3.726599 3.716573 3.193986
C  3.728506 -0.147662 -1.18563
C  -1.263346 -1.627679 1.051905
C  -2.888499 1.193289 -1.720003
C  -3.659281 0.716464 -0.673463
C  3.980477 -2.214671 -1.63231
H  0.341113 1.604536 0.04546
H  1.697461 1.995616 -1.003716
H  1.50089 2.887728 1.858436
H  2.762735 3.206222 0.665603
H  3.181556 1.635441 3.252672
H  4.423019 2.017245 2.069244
H  -0.989896 1.09819 -2.693288
H  -3.762076 -0.549505 1.042872
H  1.83374 -2.753844 -1.416717
H  4.508404 3.640413 3.949324
H  4.035423 4.480424 2.47828
H  2.823849 4.075187 3.690597
H  3.903194 0.90267 -1.026329
H  -3.289476 1.912797 -2.420406
H  4.503067 -3.124878 -1.877281
elementType: Cl F O N C H
totalener: -1579.96890900 hartree
nucrepener: 2127.82708194 hartree
electener: -3707.79599094 hartree
oneelecener: -6397.70568748 hartree
twoeener: 2689.90969655 hartree
cpcmener: -0.02940519 hartree
kineticenergy: 1574.92512582 hartree
xcener: -123.747262796661 hartree
chargesum: 0.0000000
charge: -0.089577 -0.176632 -0.180115 -0.177679 -0.362332 -0.028435 -0.298648 -0.386750 0.231637 -0.009635 0.029519 0.058011 -0.076436 -0.146163 -0.164873 -0.086532 -0.120706 -0.280141 0.073155 0.560049 -0.112557 0.087092 -0.123334 0.129768 0.151050 0.085746 0.076946 0.061025 0.061981 0.157320 0.134399 0.180583 0.094846 0.080979 0.083383 0.163232 0.149498 0.170328
qa: -0.0896 -0.1766 -0.1801 -0.1777 -0.3623 -0.0284 -0.2986 -0.3867 0.2316 -0.0096 0.0295 0.0580 -0.0764 -0.1462 -0.1649 -0.0865 -0.1207 -0.2801 0.0732 0.5600 -0.1126 0.0871 -0.1233 0.1298 0.1510 0.0857 0.0769 0.0610 0.0620 0.1573 0.1344 0.1806 0.0948 0.0810 0.0834 0.1632 0.1495 0.1703
va: 1.2135 1.1216 1.1140 1.1258 1.9430 3.3247 3.0234 3.1111 3.9099 3.9878 3.8896 3.9994 3.8959 3.8331 3.9935 3.9832 3.9095 3.9576 4.0564 4.4227 3.9859 3.8507 4.0440 0.9982 0.9818 0.9922 0.9924 1.0119 1.0097 0.9978 1.0244 1.0047 1.0027 1.0010 1.0014 0.9999 1.0012 0.9988
dispcorr: -0.017791683 hartree
energy: -1579.986700682144
dipole: 35.78143 -36.59554 -0.81411 25.14741 -22.75362 2.39379 4.73985 -5.09832 -0.35847
magnitude: 2.55372 au
magnitude: 6.49105 debye
