program: Orca
programVersion: 4.2.1
elementType: Cl F F F O N N N C C C C C C C C C C C C C C C H H H H H H H H H H H H H H H
charge: 0
multiplicity: 1
keywords: wb97x-d3
keywords: def2-TZVPP
keywords: def2/J RIJCOSX GRIDX6 NOFINALGRIDX
keywords: grid4 nofinalgrid
keywords: scfconv7
keywords: smallprint printgap noloewdin
keywords: NOSOSCF
formula: C15H15ClF3N3O
InChI: InChI=1S/C15H15ClF3N3O/c1-2-7-23-9-14(22-6-5-20-10-22)21-13-4-3-11(16)8-12(13)15(17,18)19/h3-6,8,10H,2,7,9H2,1H3
38 atoms
Cl -5.315304 1.064913 0.697326
F  -0.016203 -0.2295 -1.88512
F  -0.767284 -2.220275 -1.575873
F  -1.918336 -0.801385 -2.702464
O  2.221133 1.333748 -0.275762
N  2.417124 -1.181226 0.908831
N  0.148101 -1.144436 0.915283
N  4.555134 -1.632022 1.214091
C  1.217386 -0.472283 0.860781
C  1.334391 1.023713 0.760365
C  2.445561 2.724813 -0.398795
C  -1.108672 -0.554194 0.840685
C  3.542784 2.970498 -1.411383
C  -1.800736 -0.47836 -0.373712
C  -1.741151 -0.116419 2.001118
C  -3.09424 0.023956 -0.416055
C  2.561583 -2.541808 0.721501
C  3.771527 4.460327 -1.616065
C  3.66124 -0.693206 1.203457
C  -1.130509 -0.933824 -1.633182
C  -3.029127 0.385873 1.963246
C  -3.699116 0.449262 0.75288
C  3.878819 -2.791044 0.906128
H  1.681844 1.412469 1.72942
H  0.341219 1.454425 0.593933
H  2.732364 3.149494 0.573013
H  1.520876 3.23073 -0.708103
H  4.465954 2.496405 -1.068273
H  3.2774 2.502576 -2.362801
H  -1.2184 -0.179183 2.945957
H  -3.633318 0.087649 -1.350507
H  1.73476 -3.178309 0.461313
H  2.878044 4.950041 -2.006767
H  4.037365 4.955691 -0.68064
H  4.580691 4.640389 -2.323198
H  3.852316 0.343852 1.421534
H  -3.502189 0.72353 2.874968
H  4.385929 -3.739242 0.831571
elementType: Cl F O N C H
totalener: -1579.96844416 hartree
nucrepener: 2136.25013706 hartree
electener: -3716.21858122 hartree
oneelecener: -6414.56535772 hartree
twoeener: 2698.34677650 hartree
cpcmener: -0.02898279 hartree
kineticenergy: 1574.92542049 hartree
xcener: -123.747133576554 hartree
chargesum: -0.0000000
charge: -0.090388 -0.177400 -0.177016 -0.177430 -0.358285 -0.026670 -0.295001 -0.386529 0.221108 -0.007953 0.033050 0.060506 -0.077356 -0.156363 -0.166930 -0.085305 -0.120995 -0.279920 0.074000 0.565468 -0.111501 0.086366 -0.122703 0.152781 0.131481 0.076289 0.084121 0.061601 0.060202 0.154243 0.134441 0.180641 0.082509 0.081440 0.095111 0.162848 0.149401 0.170135
qa: -0.0904 -0.1774 -0.1770 -0.1774 -0.3583 -0.0267 -0.2950 -0.3865 0.2211 -0.0080 0.0331 0.0605 -0.0774 -0.1564 -0.1669 -0.0853 -0.1210 -0.2799 0.0740 0.5655 -0.1115 0.0864 -0.1227 0.1528 0.1315 0.0763 0.0841 0.0616 0.0602 0.1542 0.1344 0.1806 0.0825 0.0814 0.0951 0.1628 0.1494 0.1701
va: 1.2127 1.1179 1.1207 1.1261 1.9404 3.3190 3.0230 3.1111 3.9288 3.9697 3.8889 4.0014 3.8972 3.8448 3.9993 3.9833 3.9112 3.9568 4.0553 4.4121 3.9849 3.8435 4.0454 0.9842 0.9975 0.9923 0.9924 1.0096 1.0120 1.0010 1.0243 1.0051 1.0016 1.0009 1.0028 1.0003 1.0011 0.9989
dispcorr: -0.017962617 hartree
energy: -1579.986406779094
dipole: 35.03290 -35.88143 -0.84853 22.83247 -20.83338 1.99909 5.75676 -4.58809 1.16867
magnitude: 2.46620 au
magnitude: 6.26859 debye
