program: Orca
programVersion: 4.2.1
elementType: Cl F F F O N N N C C C C C C C C C C C C C C C H H H H H H H H H H H H H H H
charge: 0
multiplicity: 1
keywords: wb97x-d3
keywords: def2-TZVPP
keywords: def2/J RIJCOSX GRIDX6 NOFINALGRIDX
keywords: grid4 nofinalgrid
keywords: scfconv7
keywords: smallprint printgap noloewdin
keywords: NOSOSCF
formula: C15H15ClF3N3O
InChI: InChI=1S/C15H15ClF3N3O/c1-2-7-23-9-14(22-6-5-20-10-22)21-13-4-3-11(16)8-12(13)15(17,18)19/h3-6,8,10H,2,7,9H2,1H3
38 atoms
Cl -5.267527 1.097713 0.7153
F  0.023131 -0.206269 -1.896526
F  -0.797996 -2.183676 -1.69446
F  -1.890187 -0.669927 -2.755124
O  2.223463 1.302762 -0.182136
N  2.421369 -1.257263 0.906392
N  0.151993 -1.225595 0.855703
N  4.558792 -1.713435 1.208833
C  1.220584 -0.549529 0.866921
C  1.335819 0.950406 0.83988
C  2.393677 2.701938 -0.299381
C  -1.100561 -0.623112 0.801048
C  3.398819 2.988595 -1.393578
C  -1.782705 -0.473179 -0.411829
C  -1.734562 -0.238306 1.979242
C  -3.064325 0.060018 -0.435886
C  2.571637 -2.609196 0.667229
C  3.595588 4.484536 -1.58483
C  3.662287 -0.777191 1.227275
C  -1.116234 -0.883711 -1.68869
C  -3.011853 0.291044 1.960215
C  -3.668589 0.437252 0.749823
C  3.888445 -2.861292 0.85005
H  1.676974 1.299658 1.82586
H  0.3428 1.386068 0.685109
H  2.740453 3.124326 0.653807
H  1.432667 3.181275 -0.531311
H  4.3530 2.51807 -1.142811
H  3.056424 2.538562 -2.328894
H  -1.220525 -0.363674 2.922635
H  -3.594322 0.186793 -1.369093
H  1.748136 -3.237913 0.379445
H  4.327426 4.685414 -2.366865
H  2.664723 4.97629 -1.872478
H  3.952929 4.961564 -0.670669
H  3.84908 0.251061 1.486755
H  -3.485968 0.586526 2.885883
H  4.398588 -3.804711 0.742986
elementType: Cl F O N C H
totalener: -1579.96856101 hartree
nucrepener: 2137.67902066 hartree
electener: -3717.64758167 hartree
oneelecener: -6417.43026479 hartree
twoeener: 2699.78268313 hartree
cpcmener: -0.02880400 hartree
kineticenergy: 1574.92267211 hartree
xcener: -123.746490393838 hartree
chargesum: 0.0000000
charge: -0.090225 -0.177227 -0.177407 -0.177500 -0.357020 -0.029276 -0.295983 -0.386445 0.223347 -0.003256 0.038373 0.056157 -0.080718 -0.153291 -0.164872 -0.084855 -0.121437 -0.280636 0.073513 0.563934 -0.110970 0.086463 -0.122061 0.153169 0.127257 0.077318 0.079822 0.062492 0.060055 0.153597 0.134183 0.181016 0.094988 0.082516 0.081764 0.163545 0.149681 0.169987
qa: -0.0902 -0.1772 -0.1774 -0.1775 -0.3570 -0.0293 -0.2960 -0.3864 0.2233 -0.0033 0.0384 0.0562 -0.0807 -0.1533 -0.1649 -0.0849 -0.1214 -0.2806 0.0735 0.5639 -0.1110 0.0865 -0.1221 0.1532 0.1273 0.0773 0.0798 0.0625 0.0601 0.1536 0.1342 0.1810 0.0950 0.0825 0.0818 0.1635 0.1497 0.1700
va: 1.2129 1.1183 1.1201 1.1260 1.9414 3.3222 3.0207 3.1110 3.9292 3.9653 3.8875 4.0070 3.9027 3.8410 3.9958 3.9852 3.9099 3.9566 4.0552 4.4129 3.9833 3.8447 4.0442 0.9847 0.9984 0.9926 0.9926 1.0091 1.0120 1.0009 1.0244 1.0053 1.0028 1.0012 1.0013 1.0005 1.0011 0.9989
dispcorr: -0.017936763 hartree
energy: -1579.986497773314
dipole: 34.12544 -35.00866 -0.88322 22.26543 -20.32866 1.93677 6.31563 -5.08336 1.23228
magnitude: 2.45960 au
magnitude: 6.25182 debye
