program: Gaussian 09
title: 000003180
version: EM64L-G09RevD.01
frameworkgroup: C1[X(C18H27NO2)]
method: RPBEPBE
basis: SDD
operation: Freq
keyword: #p
keyword: freq=noraman
keyword: PBEPBE/SDD
title: #p freq=noraman PBEPBE/SDD
converged: NO YES NO NO
title: Mulliken charges:
elementType: O O N C C C C C C C C C C C C C C C C C C H H H H H H H H H H H H H H H H H H H H H H H H H H H
charge: -0.236137 -0.257430 -0.075100 -0.367018 -0.347429 -0.392236 -0.399157 -0.397309 -0.352977 -0.538484 0.110879 0.286457 -0.318184 -0.358731 -0.381969 0.357274 -0.403187 -0.358471 -0.295353 -0.342396 -0.685649 0.214069 0.167197 0.169453 0.200334 0.191187 0.202933 0.203190 0.190271 0.188985 0.212296 0.227569 0.198091 0.248842 0.233833 0.249328 0.275703 0.212283 0.212020 0.207998 0.208005 0.252769 0.251833 0.194492 0.194791 0.219285 0.212971 0.212878
chargesum: 0.00000
title: Mulliken charges with hydrogens summed into heavy atoms:
elementType: O O N C C C C C C C C C C C C C C C C C C
charge: -0.236137 -0.257430 -0.075100 0.014248 0.022358 0.001884 -0.005696 0.003971 0.072684 -0.055809 0.110879 0.286457 -0.068856 -0.083028 0.042334 0.357274 -0.150418 -0.106637 0.120649 0.046888 -0.040515
polarizability: 3.32174389e+02 1.11160053e+01 1.92987753e+02 7.02177032e-01 -3.04797552e+00 1.37277104e+02
1716.lowfreq: -27.2945 -19.3553 -6.5739 -1.6914 -0.0007 0.0012 0.0016 8.6729 25.9420
frequency: -21.0273 8.2398 24.3487 30.4853 42.5056 58.5004 68.1314 82.0843 96.4703 125.8338 131.9059 149.2342 154.7573 189.0611 218.4219 232.0067 233.1699 268.3599 283.6393 298.4261 307.7790 377.0293 393.0253 406.6607 414.8704 440.5762 447.7477 475.3831 488.6293 520.6785 546.4619 568.3256 616.2981 627.8369 725.9185 730.9010 740.7586 782.9277 788.4676 804.1654 808.3832 817.6167 828.3946 844.9592 855.1812 856.5790 903.7024 905.9788 937.5985 957.0756 960.5133 964.5032 973.3426 986.1623 995.8111 1007.6410 1028.0334 1041.2153 1049.0293 1069.7674 1083.9986 1093.8851 1108.6407 1117.7217 1120.8154 1124.9055 1145.2753 1149.3830 1154.8098 1168.8136 1173.0665 1212.9457 1214.4235 1233.7880 1243.6776 1258.1541 1265.3167 1272.8205 1280.3320 1283.9602 1285.3156 1295.1433 1299.7541 1312.6254 1330.7638 1337.9676 1344.1895 1345.2190 1349.2285 1366.6562 1369.6309 1379.9400 1391.1021 1394.8039 1429.0081 1435.3355 1451.8609 1459.5023 1461.6939 1466.5243 1467.8287 1469.0410 1471.1940 1477.8902 1478.9443 1480.4142 1488.9113 1499.6519 1556.2747 1584.6760 1620.6179 2813.8585 2826.2591 2885.0379 2951.2631 2965.9624 2966.4653 2972.5248 2976.8248 2983.4387 2984.6205 2994.9575 3008.7340 3012.4415 3020.8134 3024.3794 3027.3961 3034.7645 3043.9926 3049.1243 3053.3787 3060.4603 3075.3245 3077.8529 3145.6386 3146.8835 3167.5243 3171.1315
redmass: 2.2108 3.9687 3.4267 4.1371 2.4604 3.6561 4.0428 3.8670 2.5717 3.0716 2.8068 2.6585 4.0671 3.4673 3.1534 1.1121 1.9063 5.0040 5.4898 3.1319 2.5856 1.9893 2.6947 4.6235 2.9703 3.3456 3.0141 3.8484 3.0126 4.1075 1.9250 2.1374 5.7168 7.0647 4.0683 3.1617 1.0772 3.9104 1.6191 1.6427 1.1595 3.8226 1.2386 1.6013 1.5354 2.4455 1.8076 2.3749 1.1535 1.3127 6.4233 1.3577 3.8794 1.3498 2.8955 2.4711 1.9543 3.4317 2.1671 1.7574 2.1856 2.0194 2.1691 1.5429 2.4509 2.2018 1.4558 1.2862 2.3890 1.2495 1.2865 1.3707 1.7140 3.0661 2.0288 1.2606 1.1759 1.3090 1.1719 1.2208 1.0686 1.3824 1.4803 1.7176 1.2979 1.4140 1.5250 1.4777 1.4756 1.6468 2.2553 1.8291 1.2273 1.4639 3.9163 1.1398 1.0907 1.0874 1.0870 1.0844 1.0816 1.0894 1.0805 1.0446 1.0993 1.0991 1.1268 2.1651 7.6474 7.4628 6.6276 1.0716 1.0701 1.0706 1.0551 1.0627 1.0589 1.0603 1.0361 1.0612 1.0615 1.0592 1.1019 1.1052 1.0944 1.0867 1.0902 1.0934 1.1032 1.0917 1.1036 1.1045 1.1016 1.0994 1.0878 1.0881 1.0953 1.0966
irintensity: 0.0396 0.2598 0.8690 0.2690 0.5418 0.3585 0.7625 1.5946 3.1951 0.3530 0.0266 3.9645 0.0900 8.7898 0.4423 0.0663 0.6452 3.8454 0.7245 3.9729 2.0757 3.2272 1.1006 1.6029 0.0921 1.4412 2.5579 14.4373 6.6796 0.4217 9.7647 10.6707 30.2810 4.9687 8.0134 0.6188 10.9177 1.2046 25.4360 1.5302 0.3888 14.1521 0.4860 50.2134 7.6360 9.3066 24.1862 5.5541 0.3392 9.7701 120.1406 0.2115 48.8674 1.3013 0.9475 1.0768 8.2620 26.6474 8.9659 4.3688 11.3663 1.2014 54.3223 8.1152 3.4075 13.5462 1.9045 5.3019 61.0929 1.8667 258.1348 1.2267 44.2334 233.5841 91.5155 6.9722 5.8584 6.9897 0.3141 2.0507 0.1135 18.6698 54.0244 128.2649 16.5024 3.7003 31.1110 5.8107 19.7239 2.4777 36.2241 68.5740 3.8558 14.1182 1.8375 14.5686 7.9195 3.9825 13.5992 4.4412 4.5228 11.0155 2.4760 14.0174 8.9492 29.4615 24.0614 16.2643 109.5087 186.4177 169.2988 50.2775 149.2561 84.7240 26.7015 40.7818 36.0446 28.8765 36.1555 32.3715 34.3783 36.3289 25.4998 0.9862 15.5838 67.8264 70.8940 28.0680 22.2892 33.7050 102.7097 17.2299 102.2504 48.7287 9.2169 1.4382 17.9821 6.5555
temp: 298.150 k
press: 1.00000 atm
elementType: 8 8 7 6 6 6 6 6 6 6 6 6 6 6 6 6 6 6 6 6 6 1 1 1 1 1 1 1 1 1 1 1 1 1 1 1 1 1 1 1 1 1 1 1 1 1 1 1
symmnumber: 1
zpe: 1088248.9 jmol-1
zpe.correction: 0.414492 hartree
zpe.thermalcorrener: 0.435742 hartree
zpe.thermalcorrenthalpy: 0.436687 hartree
zpe.thermalcorrgfe: 0.360768 hartree
zpe.sumelectzpe: -905.674083 hartree
zpe.sumelectthermal: -905.652832 hartree
zpe.sumelectthermalent: -905.651888 hartree
zpe.sumelectthermalfe: -905.727807 hartree
dipole: -2.9653 -1.6521 -0.2948
dipole: 3.4073
quadrupole: -97.0840 -133.5634 -129.6561
quadrupole: -8.8415 -0.8220 1.6247
quadrupole: 23.0172 -13.4623 -9.5549 -8.8415 -0.8220 1.6247
hfenergy: -906.0885746 hartree
pointgroup: C01 [X(C18H27N1O2)]
dipole: 1.1629594 0.6667214 -0.003415 debye
polarizability: 332.0436791|12.0492338|189.7862469|-1.4682302|13.3849486|140.6093202 unknown
InChI: InChI=1S/C18H27NO2/c1-2-3-15-21-17-9-7-16(8-10-17)18(20)11-14-19-12-5-4-6-13-19/h7-10H,2-6,11-15H2,1H3
charge 0 multiplicity 1
48 atoms
O  -1.247295 -2.258089 -0.92197
O  4.302864 0.916344 0.0326
N  -4.70276 0.0190 0.122424
C  -5.914368 -0.791699 0.41902
C  -5.025029 1.140897 -0.79785
C  -7.020185 0.071808 1.059261
C  -6.104505 2.065795 -0.199688
C  -7.380108 1.264584 0.145162
C  -3.588731 -0.82737 -0.37691
C  -2.222989 -0.134645 -0.222575
C  -1.047054 -1.061781 -0.543963
C  0.344999 -0.530842 -0.397825
C  0.627523 0.790188 0.055802
C  1.436642 -1.381027 -0.718778
C  6.724046 0.890843 0.02898
C  3.028004 0.374547 -0.13717
C  1.950003 1.240409 0.185901
C  2.767867 -0.945601 -0.595648
C  5.473384 0.063195 -0.270237
C  8.022245 0.098745 -0.254145
C  9.290956 0.9227 0.052945
H  -5.62286 -1.607213 1.106994
H  -6.319169 -1.270861 -0.512852
H  -5.383222 0.750588 -1.789193
H  -4.103997 1.721141 -0.99061
H  -7.911031 -0.556167 1.253678
H  -6.654972 0.450231 2.033765
H  -5.702593 2.534036 0.719757
H  -6.332896 2.876499 -0.918434
H  -7.840237 0.885219 -0.791036
H  -8.129476 1.916612 0.632842
H  -3.571276 -1.761081 0.213278
H  -3.736424 -1.136529 -1.440875
H  -2.132418 0.23676 0.817971
H  -2.15172 0.761229 -0.872025
H  -0.189651 1.471203 0.314197
H  1.208568 -2.394517 -1.066129
H  6.702648 1.811818 -0.584507
H  6.700102 1.209077 1.088774
H  5.437529 -0.84812 0.362142
H  5.440578 -0.240645 -1.337126
H  2.179824 2.250947 0.536605
H  3.585375 -1.625289 -0.851925
H  8.029824 -0.829728 0.352663
H  8.037608 -0.220656 -1.316221
H  10.207571 0.341614 -0.155078
H  9.317463 1.228342 1.115562
H  9.325545 1.841487 -0.561754
