program: Orca
programVersion: 4.2.1
elementType: Cl F F F O N N N C C C C C C C C C C C C C C C H H H H H H H H H H H H H H H
charge: 0
multiplicity: 1
keywords: wb97x-d3
keywords: def2-TZVPP
keywords: def2/J RIJCOSX GRIDX6 NOFINALGRIDX
keywords: grid4 nofinalgrid
keywords: scfconv7
keywords: smallprint printgap noloewdin
keywords: NOSOSCF
formula: C15H15ClF3N3O
InChI: InChI=1S/C15H15ClF3N3O/c1-2-7-23-9-14(22-6-5-20-10-22)21-13-4-3-11(16)8-12(13)15(17,18)19/h3-6,8,10H,2,7,9H2,1H3
38 atoms
Cl -5.048882 1.350001 0.741874
F  -0.683521 -2.257512 -1.445323
F  -1.816575 -0.856005 -2.611465
F  0.117286 -0.304462 -1.856144
O  2.441299 1.089665 -0.430843
N  2.548296 -1.319659 0.973015
N  0.285731 -1.151235 0.997886
N  4.665979 -1.867517 1.261517
C  1.390719 -0.547027 0.888249
C  1.593171 0.928454 0.672439
C  2.690686 2.442388 -0.771935
C  -0.937632 -0.49638 0.906701
C  1.5696 3.0862 -1.570471
C  -1.640954 -0.432249 -0.30225
C  -1.530307 0.022389 2.054739
C  -2.905388 0.138965 -0.350706
C  2.611304 -2.696884 0.893011
C  1.956302 4.494881 -1.997058
C  3.82561 -0.882582 1.196205
C  -1.011417 -0.964948 -1.552299
C  -2.7883 0.594822 2.010101
C  -3.46987 0.645842 0.805737
C  3.917435 -3.006312 1.065144
H  2.019165 1.368392 1.585975
H  0.616924 1.400603 0.529336
H  3.606037 2.434674 -1.367668
H  2.899204 3.031039 0.131098
H  1.357784 2.474651 -2.450798
H  0.649191 3.125031 -0.981694
H  -0.999741 -0.031412 2.995735
H  -3.452869 0.193518 -1.280783
H  1.74349 -3.303941 0.706475
H  1.160207 4.965385 -2.573385
H  2.157745 5.132788 -1.134702
H  2.853133 4.489072 -2.61917
H  4.079994 0.15599 1.324072
H  -3.229013 0.996181 2.912147
H  4.368297 -3.985334 1.055785
elementType: Cl F O N C H
totalener: -1579.96673596 hartree
nucrepener: 2160.50456691 hartree
electener: -3740.47130288 hartree
oneelecener: -6463.07034633 hartree
twoeener: 2722.59904345 hartree
cpcmener: -0.02907548 hartree
kineticenergy: 1574.92151504 hartree
xcener: -123.747392428992 hartree
chargesum: 0.0000000
charge: -0.090166 -0.176720 -0.177869 -0.175294 -0.369943 -0.027800 -0.295154 -0.385791 0.226807 -0.010376 0.026232 0.072349 -0.075580 -0.167682 -0.160160 -0.088545 -0.119952 -0.277228 0.071393 0.567029 -0.112781 0.088807 -0.123187 0.156860 0.125691 0.099724 0.076689 0.058024 0.055098 0.152353 0.133887 0.180033 0.093522 0.083331 0.083541 0.163774 0.149017 0.170070
qa: -0.0902 -0.1767 -0.1779 -0.1753 -0.3699 -0.0278 -0.2952 -0.3858 0.2268 -0.0104 0.0262 0.0723 -0.0756 -0.1677 -0.1602 -0.0885 -0.1200 -0.2772 0.0714 0.5670 -0.1128 0.0888 -0.1232 0.1569 0.1257 0.0997 0.0767 0.0580 0.0551 0.1524 0.1339 0.1800 0.0935 0.0833 0.0835 0.1638 0.1490 0.1701
va: 1.2130 1.1209 1.1260 1.1180 1.9265 3.3215 3.0218 3.1122 3.9086 3.9701 3.9177 3.9797 3.8577 3.8469 3.9894 3.9864 3.9099 3.9603 4.0582 4.3979 3.9866 3.8425 4.0447 0.9868 0.9914 0.9955 0.9977 1.0160 1.0132 1.0019 1.0244 1.0055 1.0022 1.0009 1.0013 1.0005 1.0013 0.9990
dispcorr: -0.018715193 hartree
energy: -1579.985451155139
dipole: 27.57471 -28.43887 -0.86416 22.34292 -20.22420 2.11871 3.43955 -2.41126 1.02829
magnitude: 2.50861 au
magnitude: 6.37637 debye
