program: Orca
programVersion: 4.2.1
elementType: Cl F F F O N N N C C C C C C C C C C C C C C C H H H H H H H H H H H H H H H
charge: 0
multiplicity: 1
keywords: wb97x-d3
keywords: def2-TZVPP
keywords: def2/J RIJCOSX GRIDX6 NOFINALGRIDX
keywords: grid4 nofinalgrid
keywords: scfconv7
keywords: smallprint printgap noloewdin
keywords: NOSOSCF
formula: C15H15ClF3N3O
InChI: InChI=1S/C15H15ClF3N3O/c1-2-7-23-9-14(22-6-5-20-10-22)21-13-4-3-11(16)8-12(13)15(17,18)19/h3-6,8,10H,2,7,9H2,1H3
38 atoms
Cl -5.049515 1.612344 -0.166646
F  -2.506694 -2.552073 1.493843
F  -1.151321 -3.009826 -0.105643
F  -0.464413 -1.896552 1.60105
O  2.235131 1.675244 0.530191
N  2.565702 -0.947645 -0.619503
N  0.330669 -0.674918 -0.941036
N  3.973881 -2.255548 -1.705523
C  1.352935 -0.349717 -0.271629
C  1.40057 0.608415 0.887547
C  2.478365 2.553921 1.614817
C  -0.918645 -0.112474 -0.696291
C  3.444005 3.634521 1.183401
C  -1.87067 -0.775108 0.086641
C  -1.269287 1.0882 -1.306822
C  -3.140762 -0.239892 0.250937
C  3.792667 -0.810546 0.003428
C  2.934484 4.495977 0.037792
C  2.749121 -1.835882 -1.644663
C  -1.503849 -2.058691 0.764888
C  -2.533873 1.624788 -1.145873
C  -3.462952 0.954469 -0.368014
C  4.634843 -1.621024 -0.678342
H  1.772723 0.076272 1.774201
H  0.388199 0.950236 1.126713
H  2.893905 1.995135 2.463443
H  1.534943 3.0020 1.955119
H  3.631729 4.259239 2.059785
H  4.403696 3.18205 0.919801
H  -0.544217 1.602723 -1.922747
H  -3.879787 -0.742504 0.8585
H  3.963869 -0.174038 0.852391
H  2.807091 3.921736 -0.879694
H  1.972369 4.950309 0.282041
H  3.632937 5.30448 -0.178925
H  1.947592 -2.127691 -2.301878
H  -2.786228 2.559869 -1.626441
H  5.683194 -1.784642 -0.489242
elementType: Cl F O N C H
totalener: -1579.96816059 hartree
nucrepener: 2132.13631006 hartree
electener: -3712.10447064 hartree
oneelecener: -6406.04763545 hartree
twoeener: 2693.94316480 hartree
cpcmener: -0.02663693 hartree
kineticenergy: 1574.92388386 hartree
xcener: -123.746693277374 hartree
chargesum: -0.0000000
charge: -0.089056 -0.176489 -0.176041 -0.181575 -0.366788 -0.029732 -0.301890 -0.383306 0.250652 -0.009707 0.012455 0.045928 -0.102874 -0.141884 -0.163237 -0.085234 -0.123654 -0.256854 0.070256 0.563839 -0.110111 0.084888 -0.124996 0.139756 0.130336 0.095420 0.093298 0.067286 0.061732 0.154065 0.133857 0.182708 0.078354 0.077502 0.093315 0.166782 0.150095 0.170904
qa: -0.0891 -0.1765 -0.1760 -0.1816 -0.3668 -0.0297 -0.3019 -0.3833 0.2507 -0.0097 0.0125 0.0459 -0.1029 -0.1419 -0.1632 -0.0852 -0.1237 -0.2569 0.0703 0.5638 -0.1101 0.0849 -0.1250 0.1398 0.1303 0.0954 0.0933 0.0673 0.0617 0.1541 0.1339 0.1827 0.0784 0.0775 0.0933 0.1668 0.1501 0.1709
va: 1.2140 1.1280 1.1236 1.1122 1.9220 3.3423 2.9959 3.1146 3.8778 3.9541 3.8798 4.0173 3.9283 3.8302 3.9825 3.9853 3.9236 3.9163 4.0179 4.4169 3.9878 3.8499 4.0336 0.9867 1.0001 0.9965 0.9927 1.0118 1.0124 1.0010 1.0245 0.9914 1.0117 1.0027 1.0044 1.0138 1.0010 0.9990
dispcorr: -0.018148737 hartree
energy: -1579.986309322429
dipole: 36.41119 -36.45854 -0.04735 30.02550 -27.58067 2.44483 1.94355 -0.28484 1.65871
magnitude: 2.95479 au
magnitude: 7.51047 debye
