program: Orca
programVersion: 4.2.1
elementType: Cl F F F O N N N C C C C C C C C C C C C C C C H H H H H H H H H H H H H H H
charge: 0
multiplicity: 1
keywords: wb97x-d3
keywords: def2-TZVPP
keywords: def2/J RIJCOSX GRIDX6 NOFINALGRIDX
keywords: grid4 nofinalgrid
keywords: scfconv7
keywords: smallprint printgap noloewdin
keywords: NOSOSCF
formula: C15H15ClF3N3O
InChI: InChI=1S/C15H15ClF3N3O/c1-2-7-23-9-14(22-6-5-20-10-22)21-13-4-3-11(16)8-12(13)15(17,18)19/h3-6,8,10H,2,7,9H2,1H3
38 atoms
Cl -4.974953 1.553792 -0.507542
F  -0.114116 -1.192309 1.812249
F  -2.126497 -1.909414 2.010704
F  -0.845308 -2.730868 0.498931
O  2.703734 1.800442 0.298676
N  2.734845 -0.703718 -1.056753
N  0.47099 -0.654233 -0.988939
N  4.064672 -2.458685 -1.20758
C  1.545039 0.008452 -0.883764
C  1.669433 1.488405 -0.58866
C  2.573855 1.292487 1.622214
C  -0.786285 -0.083342 -0.845376
C  1.979589 2.290702 2.597327
C  -1.654908 -0.545719 0.152125
C  -1.25244 0.872802 -1.74484
C  -2.939145 -0.032725 0.259145
C  3.993774 -0.217874 -1.352397
C  0.526172 2.660424 2.337994
C  2.849803 -2.065307 -0.984272
C  -1.187566 -1.594374 1.114987
C  -2.536038 1.379245 -1.648993
C  -3.370071 0.925668 -0.642002
C  4.786247 -1.311913 -1.448496
H  0.697045 1.849179 -0.242522
H  1.878484 2.012876 -1.525566
H  3.581304 1.023721 1.945312
H  1.985841 0.367424 1.635159
H  2.066843 1.841547 3.59024
H  2.598319 3.191599 2.61658
H  -0.606478 1.214451 -2.543035
H  -3.609869 -0.373132 1.034918
H  4.212627 0.825054 -1.491971
H  -0.103765 1.772018 2.252585
H  0.12981 3.261711 3.156541
H  0.405191 3.247886 1.427369
H  2.010851 -2.697052 -0.744016
H  -2.874869 2.121642 -2.358104
H  5.839044 -1.3399 -1.677683
elementType: Cl F O N C H
totalener: -1579.96453082 hartree
nucrepener: 2186.51419945 hartree
electener: -3766.47873028 hartree
oneelecener: -6514.68930723 hartree
twoeener: 2748.21057695 hartree
cpcmener: -0.02719877 hartree
kineticenergy: 1574.91921103 hartree
xcener: -123.749996294707 hartree
chargesum: 0.0000000
charge: -0.087112 -0.177086 -0.178050 -0.176022 -0.393590 -0.016041 -0.308904 -0.385512 0.178144 0.014357 0.025315 0.125662 -0.092769 -0.194979 -0.158213 -0.075829 -0.120442 -0.274351 0.069040 0.562212 -0.118934 0.089018 -0.123050 0.120840 0.161992 0.105124 0.082116 0.069131 0.064180 0.162105 0.133519 0.175004 0.072930 0.103637 0.082904 0.164131 0.150177 0.169348
qa: -0.0871 -0.1771 -0.1781 -0.1760 -0.3936 -0.0160 -0.3089 -0.3855 0.1781 0.0144 0.0253 0.1257 -0.0928 -0.1950 -0.1582 -0.0758 -0.1204 -0.2744 0.0690 0.5622 -0.1189 0.0890 -0.1231 0.1208 0.1620 0.1051 0.0821 0.0691 0.0642 0.1621 0.1335 0.1750 0.0729 0.1036 0.0829 0.1641 0.1502 0.1693
va: 1.2164 1.1082 1.1254 1.1227 1.9061 3.3062 2.9993 3.1167 3.8681 3.9308 3.8764 3.8774 3.8930 3.8217 3.9352 3.9749 3.9123 3.9164 4.0225 4.4035 3.9927 3.8604 4.0257 0.9823 0.9832 1.0010 1.0014 1.0124 1.0119 0.9919 1.0242 1.0027 1.0080 1.0071 0.9970 1.0131 1.0011 0.9995
dispcorr: -0.020840624 hartree
energy: -1579.985371446878
dipole: 26.61789 -27.07880 -0.46090 20.54101 -17.91810 2.62291 3.13505 -3.43947 -0.30442
magnitude: 2.68044 au
magnitude: 6.81314 debye
