program: Orca
programVersion: 4.2.1
elementType: Cl F F F O N N N C C C C C C C C C C C C C C C H H H H H H H H H H H H H H H
charge: 0
multiplicity: 1
keywords: wb97x-d3
keywords: def2-TZVPP
keywords: def2/J RIJCOSX GRIDX6 NOFINALGRIDX
keywords: grid4 nofinalgrid
keywords: scfconv7
keywords: smallprint printgap noloewdin
keywords: NOSOSCF
formula: C15H15ClF3N3O
InChI: InChI=1S/C15H15ClF3N3O/c1-2-7-23-9-14(22-6-5-20-10-22)21-13-4-3-11(16)8-12(13)15(17,18)19/h3-6,8,10H,2,7,9H2,1H3
38 atoms
Cl -4.777782 1.781966 0.568559
F  -2.458552 -2.180481 -1.779397
F  -0.382267 -1.630991 -1.774618
F  -1.145017 -2.978826 -0.282202
O  2.39729 1.623294 -0.019868
N  2.681849 -1.212346 0.530726
N  0.461667 -0.902135 0.92544
N  4.039265 -2.756957 1.333489
C  1.497332 -0.51008 0.31421
C  1.585674 0.656017 -0.633851
C  2.637955 2.760433 -0.831814
C  -0.754831 -0.239199 0.788559
C  1.482498 3.746967 -0.850593
C  -1.738152 -0.707549 -0.090053
C  -1.038204 0.864651 1.587423
C  -2.975349 -0.082271 -0.158075
C  3.919983 -0.986711 -0.042363
C  1.827822 4.968908 -1.688482
C  2.827511 -2.298413 1.352217
C  -1.436633 -1.87574 -0.97724
C  -2.269654 1.490904 1.522727
C  -3.232344 1.009927 0.651246
C  4.730802 -1.943936 0.464294
H  0.578988 1.028199 -0.841893
H  2.004202 0.320786 -1.592258
H  2.887503 2.448956 -1.854993
H  3.526324 3.241853 -0.41744
H  0.580442 3.276085 -1.251163
H  1.253182 4.050005 0.174081
H  -0.286616 1.229701 2.274143
H  -3.738147 -0.434194 -0.838116
H  4.119024 -0.193154 -0.739969
H  1.009948 5.688988 -1.689095
H  2.713605 5.478056 -1.304667
H  2.026931 4.698497 -2.726838
H  2.008727 -2.697267 1.926739
H  -2.471033 2.349061 2.148871
H  5.776687 -2.096046 0.253205
elementType: Cl F O N C H
totalener: -1579.96720793 hartree
nucrepener: 2140.03979101 hartree
electener: -3720.00699894 hartree
oneelecener: -6421.75781989 hartree
twoeener: 2701.75082095 hartree
cpcmener: -0.02736125 hartree
kineticenergy: 1574.92383295 hartree
xcener: -123.747739366406 hartree
chargesum: -0.0000000
charge: -0.089074 -0.176514 -0.181966 -0.175638 -0.378327 -0.030225 -0.304530 -0.382988 0.258898 -0.024836 0.024312 0.074452 -0.075792 -0.139390 -0.186650 -0.089652 -0.123808 -0.279157 0.070348 0.564627 -0.110195 0.089080 -0.124441 0.126683 0.147241 0.079609 0.103276 0.056096 0.061091 0.151103 0.134374 0.182663 0.094309 0.083742 0.084016 0.166757 0.149764 0.170741
qa: -0.0891 -0.1765 -0.1820 -0.1756 -0.3783 -0.0302 -0.3045 -0.3830 0.2589 -0.0248 0.0243 0.0745 -0.0758 -0.1394 -0.1866 -0.0897 -0.1238 -0.2792 0.0703 0.5646 -0.1102 0.0891 -0.1244 0.1267 0.1472 0.0796 0.1033 0.0561 0.0611 0.1511 0.1344 0.1827 0.0943 0.0837 0.0840 0.1668 0.1498 0.1707
va: 1.2144 1.1280 1.1114 1.1244 1.9133 3.3487 3.0040 3.1143 3.8515 3.9694 3.9043 3.9838 3.8594 3.8240 3.9765 3.9927 3.9233 3.9594 4.0176 4.4161 3.9852 3.8513 4.0289 0.9974 0.9873 0.9972 0.9969 1.0133 1.0125 1.0043 1.0244 0.9911 1.0019 1.0012 1.0009 1.0138 1.0008 0.9989
dispcorr: -0.018457610 hartree
energy: -1579.985665539731
dipole: 30.78595 -30.83623 -0.05028 30.44896 -27.68375 2.76521 -3.16902 1.97274 -1.19628
magnitude: 3.01331 au
magnitude: 7.65922 debye
