program: Orca
programVersion: 4.2.1
elementType: Cl F F F O N N N C C C C C C C C C C C C C C C H H H H H H H H H H H H H H H
charge: 0
multiplicity: 1
keywords: wb97x-d3
keywords: def2-TZVPP
keywords: def2/J RIJCOSX GRIDX6 NOFINALGRIDX
keywords: grid4 nofinalgrid
keywords: scfconv7
keywords: smallprint printgap noloewdin
keywords: NOSOSCF
formula: C15H15ClF3N3O
InChI: InChI=1S/C15H15ClF3N3O/c1-2-7-23-9-14(22-6-5-20-10-22)21-13-4-3-11(16)8-12(13)15(17,18)19/h3-6,8,10H,2,7,9H2,1H3
38 atoms
Cl -5.038966 1.530554 0.494502
F  -0.307992 -1.39033 -1.894151
F  -1.091969 -2.907551 -0.586326
F  -2.348796 -2.030444 -2.089026
O  2.198708 1.867378 0.315602
N  2.598939 -0.972024 0.66883
N  0.338963 -0.856518 0.894426
N  4.004202 -2.46169 1.4928
C  1.385816 -0.33265 0.415531
C  1.458113 0.921748 -0.413768
C  1.99962 3.202547 -0.11991
C  -0.90937 -0.260624 0.749504
C  2.473943 3.481921 -1.534625
C  -1.813842 -0.696647 -0.224974
C  -1.307095 0.73537 1.637365
C  -3.084072 -0.142105 -0.303401
C  3.85384 -0.635074 0.196847
C  3.936015 3.137179 -1.770472
C  2.764757 -2.086609 1.447222
C  -1.395886 -1.7569 -1.195885
C  -2.572167 1.289115 1.564497
C  -3.45303 0.84463 0.592979
C  4.694241 -1.561024 0.713458
H  0.442978 1.278268 -0.61643
H  1.912434 0.686914 -1.385174
H  2.556728 3.821286 0.586072
H  0.939338 3.470296 -0.0237
H  1.843501 2.963182 -2.262624
H  2.311306 4.548144 -1.711536
H  -0.618752 1.071217 2.401161
H  -3.786142 -0.467908 -1.057603
H  4.042931 0.206023 -0.445472
H  4.120007 2.063289 -1.714792
H  4.258496 3.463626 -2.759159
H  4.583044 3.620629 -1.036389
H  1.939591 -2.566111 1.945753
H  -2.862895 2.061566 2.262963
H  5.75993 -1.632007 0.569647
elementType: Cl F O N C H
totalener: -1579.96650517 hartree
nucrepener: 2144.86484742 hartree
electener: -3724.83135260 hartree
oneelecener: -6431.35848631 hartree
twoeener: 2706.52713371 hartree
cpcmener: -0.02696362 hartree
kineticenergy: 1574.92234879 hartree
xcener: -123.748376408792 hartree
chargesum: 0.0000000
charge: -0.089650 -0.181917 -0.176342 -0.176632 -0.373724 -0.024224 -0.307826 -0.379107 0.254498 -0.033153 0.018503 0.062946 -0.100207 -0.136784 -0.181674 -0.086777 -0.133979 -0.283079 0.071855 0.561047 -0.106660 0.085538 -0.130132 0.133431 0.145978 0.102187 0.085710 0.069935 0.079727 0.152990 0.134112 0.190260 0.081836 0.100583 0.084102 0.165602 0.149619 0.171408
qa: -0.0897 -0.1819 -0.1763 -0.1766 -0.3737 -0.0242 -0.3078 -0.3791 0.2545 -0.0332 0.0185 0.0629 -0.1002 -0.1368 -0.1817 -0.0868 -0.1340 -0.2831 0.0719 0.5610 -0.1067 0.0855 -0.1301 0.1334 0.1460 0.1022 0.0857 0.0699 0.0797 0.1530 0.1341 0.1903 0.0818 0.1006 0.0841 0.1656 0.1496 0.1714
va: 1.2134 1.1122 1.1230 1.1277 1.8987 3.3428 3.0014 3.1267 3.8848 3.9672 3.9049 3.9990 3.8296 3.8231 3.9792 3.9858 3.9190 3.9408 4.0180 4.4216 3.9863 3.8517 4.0512 0.9955 0.9775 0.9940 1.0015 1.0064 1.0121 1.0025 1.0242 0.9906 0.9967 1.0049 1.0010 1.0148 1.0009 1.0002
dispcorr: -0.019038232 hartree
energy: -1579.985543404402
dipole: 35.86074 -36.16639 -0.30565 26.81312 -23.90659 2.90653 -1.16842 0.26325 -0.90517
magnitude: 3.05952 au
magnitude: 7.77668 debye
