program: Gaussian 09
title: 000029887
version: EM64L-G09RevD.01
frameworkgroup: C1[X(C13H17NO3)]
method: RPBEPBE
basis: SDD
operation: Freq
keyword: #p
keyword: freq=noraman
keyword: PBEPBE/SDD
title: #p freq=noraman PBEPBE/SDD
converged: YES YES NO NO
title: Mulliken charges:
elementType: O O O N C C C C C C C C C C C C C H H H H H H H H H H H H H H H H H
charge: -0.332396 -0.271546 -0.443410 -0.469531 0.056272 -0.432389 -0.445971 -0.399500 -0.396349 -0.387288 0.248985 0.529173 -0.586243 -0.394877 0.348742 -0.168219 -0.428923 0.231786 0.199502 0.238113 0.213912 0.204487 0.205497 0.200166 0.197677 0.205738 0.203085 0.190457 0.331784 0.249254 0.301158 0.224782 0.220979 0.355096
chargesum: 0.00000
title: Mulliken charges with hydrogens summed into heavy atoms:
elementType: O O O N C C C C C C C C C C C C C
charge: -0.332396 -0.271546 -0.088315 -0.137746 0.288058 0.005225 -0.027573 0.006163 0.007065 0.006254 0.248985 0.529173 -0.336989 -0.093719 0.348742 0.056562 -0.207944
polarizability: 2.46128656e+02 1.14364937e-02 1.46262723e+02 -4.61257139e+00 -8.06466367e+00 9.60210188e+01
1716.lowfreq: -14.6402 -1.7432 0.0005 0.0007 0.0008 8.8911 25.8452 33.5134 54.8391
frequency: 25.7979 33.2703 54.7151 73.0295 88.9512 127.0133 194.8530 213.4104 217.8676 226.8429 248.7610 288.8015 321.6572 332.2151 355.9312 423.1605 427.5050 436.5173 451.2573 454.2499 511.5708 527.1022 595.4725 626.0308 651.1323 687.1722 694.3469 702.4592 766.5209 773.2023 785.1182 797.9379 841.8658 863.2284 879.5354 882.6577 893.4126 901.7147 922.3284 924.6572 974.9285 980.6418 999.0363 1018.8198 1045.0304 1052.1499 1081.5709 1090.1459 1109.8969 1141.8817 1151.5066 1154.7528 1176.0387 1198.9325 1208.6288 1240.1543 1253.7973 1258.5630 1281.4357 1301.2258 1307.0091 1318.3994 1329.7803 1335.3032 1339.6427 1350.2241 1359.2313 1392.0825 1447.5419 1460.5722 1462.7319 1463.9732 1470.7702 1479.7686 1486.1518 1529.3446 1601.4560 1635.0814 1660.1209 2969.7946 2972.5613 2973.6239 2985.6642 2988.0674 3008.9629 3034.2086 3036.6959 3045.0010 3056.0491 3065.1161 3122.1265 3147.1641 3151.6580 3198.4777 3543.3415 3587.4884
redmass: 3.6696 4.5942 4.5468 8.2335 5.0102 3.8518 4.5490 3.9161 1.9519 4.7479 4.2515 6.5527 2.0463 4.6515 1.1029 3.5577 3.6688 3.4092 2.1663 2.8764 4.1636 2.7917 3.0517 5.1292 1.5934 2.0168 7.7143 4.7588 4.2830 1.4132 1.4366 2.9491 2.0979 1.6770 1.4159 1.7780 2.1215 2.4884 1.9515 3.5733 1.3021 5.9148 2.8384 4.3341 1.8845 1.0775 1.2906 1.6037 2.6650 1.3902 2.3423 2.8477 1.1218 1.4999 1.5138 1.3140 1.2805 1.3164 2.1689 1.2301 1.3208 1.6750 1.3540 1.4927 1.4731 1.5698 1.4611 6.7062 2.4479 1.0877 1.0893 1.0915 1.0832 1.0982 2.8228 2.4286 5.4757 6.2451 8.4761 1.0643 1.0628 1.0627 1.0618 1.0646 1.0824 1.0958 1.0983 1.1010 1.1021 1.1024 1.0885 1.0924 1.0946 1.0949 1.0760 1.0660
irintensity: 0.0351 0.9689 0.6181 4.6363 0.0701 1.9264 3.6723 7.0424 1.2831 1.2296 6.9285 1.7265 1.5110 11.0358 145.5117 9.3258 3.6007 1.9828 0.1952 5.9632 0.8130 2.6900 2.9822 1.9951 38.9767 35.5712 6.4386 50.9713 4.1040 50.2331 1.0092 5.8861 10.5897 48.0649 15.4337 8.1004 25.1174 37.5541 4.1690 145.6507 4.0516 5.1993 27.5470 284.0258 16.2119 1.3969 5.1549 29.6600 1.0994 191.6984 24.3276 493.0224 45.0823 0.7632 23.3456 0.9299 3.6077 9.1622 90.1241 2.4916 1.4052 47.4417 0.2798 4.9072 0.9286 0.9744 30.2778 130.5436 100.5607 2.2074 6.6857 12.5184 19.7523 5.2786 138.8265 393.0589 103.1480 271.4633 162.3711 35.1443 34.7037 33.9364 8.5925 18.0248 23.9210 66.4629 63.4558 40.5507 28.3470 65.5611 12.3024 12.5846 10.9985 6.4085 28.5958 40.4768
temp: 298.150 k
press: 1.00000 atm
elementType: 8 8 8 7 6 6 6 6 6 6 6 6 6 6 6 6 6 1 1 1 1 1 1 1 1 1 1 1 1 1 1 1 1 1
symmnumber: 1
zpe: 737244.1 jmol-1
zpe.correction: 0.280801 hartree
zpe.thermalcorrener: 0.296620 hartree
zpe.thermalcorrenthalpy: 0.297564 hartree
zpe.thermalcorrgfe: 0.236300 hartree
zpe.sumelectzpe: -784.753779 hartree
zpe.sumelectthermal: -784.737960 hartree
zpe.sumelectthermalent: -784.737016 hartree
zpe.sumelectthermalfe: -784.798281 hartree
dipole: 0.2136 -0.8407 0.4370
dipole: 0.9713
quadrupole: -72.0873 -102.2944 -103.8892
quadrupole: -5.6932 0.0633 0.2944
quadrupole: 20.6697 -9.5374 -11.1323 -5.6932 0.0633 0.2944
hfenergy: -785.0345804 hartree
pointgroup: C01 [X(C13H17N1O3)]
dipole: -0.0833045 0.3345598 0.1647997 debye
polarizability: 246.2205657|2.0391542|146.7494541|-1.2691258|6.4811443|95.4423779 unknown
InChI: InChI=1S/C13H17NO3/c15-11-6-4-5-10(9-11)14-13(16)17-12-7-2-1-3-8-12/h4-6,9,12,14-15H,1-3,7-8H2
charge 0 multiplicity 1
34 atoms
O  -1.384941 0.668098 0.016994
O  -0.39097 -1.429063 -0.421183
O  5.520882 1.700485 0.317855
N  0.86419 0.537869 0.021921
C  -2.748409 0.055199 -0.098038
C  -3.145791 -0.6023 1.235807
C  -3.696627 1.196069 -0.49071
C  -4.604841 -1.120139 1.161003
C  -5.157012 0.681395 -0.561624
C  -5.583848 0.012406 0.767748
C  -0.295032 -0.204906 -0.152796
C  2.210025 0.0895 -0.049828
C  3.221503 1.061136 0.156017
C  2.558476 -1.264274 -0.309563
C  4.576267 0.679242 0.103521
C  3.922941 -1.616302 -0.355639
C  4.945438 -0.663437 -0.152183
H  -2.701288 -0.715414 -0.892478
H  -3.058208 0.152391 2.042639
H  -2.450108 -1.429073 1.466108
H  -3.382975 1.626162 -1.459833
H  -3.619862 1.999321 0.26844
H  -4.892401 -1.55986 2.13468
H  -4.667691 -1.935999 0.411788
H  -5.249244 -0.054542 -1.38683
H  -5.833966 1.521451 -0.80718
H  -6.613322 -0.385095 0.681109
H  -5.59901 0.776797 1.571893
H  0.707697 1.52731 0.22614
H  2.978162 2.110186 0.356659
H  1.774133 -2.005369 -0.469488
H  4.195643 -2.65846 -0.554783
H  6.001627 -0.957831 -0.191844
H  6.440564 1.340846 0.262978
