program: Orca
programVersion: 4.2.1
elementType: Cl F F F O N N N C C C C C C C C C C C C C C C H H H H H H H H H H H H H H H
charge: 0
multiplicity: 1
keywords: wb97x-d3
keywords: def2-TZVPP
keywords: def2/J RIJCOSX GRIDX6 NOFINALGRIDX
keywords: grid4 nofinalgrid
keywords: scfconv7
keywords: smallprint printgap noloewdin
keywords: NOSOSCF
formula: C15H15ClF3N3O
InChI: InChI=1S/C15H15ClF3N3O/c1-2-7-23-9-14(22-6-5-20-10-22)21-13-4-3-11(16)8-12(13)15(17,18)19/h3-6,8,10H,2,7,9H2,1H3
38 atoms
Cl -5.218094 1.356902 0.484631
F  -0.47618 -1.640338 -1.764924
F  -1.090774 -2.997674 -0.214508
F  -2.483044 -2.403265 -1.735919
O  2.067911 1.901465 -0.338506
N  2.536338 -0.774447 0.537059
N  0.291657 -0.706172 0.901337
N  4.066292 -2.027547 1.517863
C  1.278378 -0.23002 0.269576
C  1.240266 0.857065 -0.769636
C  2.255045 2.892489 -1.335381
C  -0.993187 -0.192475 0.747026
C  3.31752 3.868102 -0.881685
C  -1.919718 -0.796677 -0.109944
C  -1.400299 0.892133 1.518593
C  -3.219078 -0.314854 -0.191415
C  3.723159 -0.546424 -0.134594
C  4.688477 3.234436 -0.6995
C  2.817464 -1.680018 1.523739
C  -1.497618 -1.960169 -0.952958
C  -2.694261 1.374318 1.441602
C  -3.59658 0.765279 0.585717
C  4.640782 -1.327831 0.480866
H  0.208041 1.19162 -0.916952
H  1.57595 0.440036 -1.730101
H  1.310012 3.415932 -1.527266
H  2.559574 2.420659 -2.27987
H  3.372171 4.653454 -1.639351
H  2.997681 4.358155 0.041846
H  -0.695518 1.358423 2.193652
H  -3.938453 -0.770034 -0.857165
H  3.81675 0.115996 -0.975627
H  5.435046 3.987657 -0.445959
H  4.694063 2.489801 0.096932
H  5.019219 2.741861 -1.616268
H  2.065615 -2.032803 2.209236
H  -2.989438 2.219916 2.047281
H  5.686164 -1.426251 0.23765
elementType: Cl F O N C H
totalener: -1579.96863343 hartree
nucrepener: 2132.71699877 hartree
electener: -3712.68563220 hartree
oneelecener: -6407.21397919 hartree
twoeener: 2694.52834699 hartree
cpcmener: -0.02689489 hartree
kineticenergy: 1574.92050878 hartree
xcener: -123.746909690145 hartree
chargesum: 0.0000000
charge: -0.088884 -0.181401 -0.176327 -0.176583 -0.370779 -0.023379 -0.305440 -0.383466 0.254612 -0.011176 0.000875 0.043087 -0.085819 -0.137199 -0.165824 -0.085884 -0.124948 -0.276989 0.071092 0.561832 -0.106357 0.083998 -0.123495 0.134731 0.139389 0.098209 0.089673 0.066186 0.062950 0.153838 0.134021 0.180663 0.100912 0.080231 0.081399 0.165918 0.149821 0.170514
qa: -0.0889 -0.1814 -0.1763 -0.1766 -0.3708 -0.0234 -0.3054 -0.3835 0.2546 -0.0112 0.0009 0.0431 -0.0858 -0.1372 -0.1658 -0.0859 -0.1249 -0.2770 0.0711 0.5618 -0.1064 0.0840 -0.1235 0.1347 0.1394 0.0982 0.0897 0.0662 0.0630 0.1538 0.1340 0.1807 0.1009 0.0802 0.0814 0.1659 0.1498 0.1705
va: 1.2144 1.1126 1.1227 1.1281 1.9182 3.3348 2.9931 3.1160 3.8592 3.9665 3.8982 4.0240 3.8976 3.8218 3.9860 3.9851 3.9252 3.9176 4.0193 4.4198 3.9829 3.8499 4.0380 0.9988 0.9879 0.9983 0.9895 1.0126 1.0139 1.0012 1.0243 0.9870 1.0057 1.0063 1.0017 1.0134 1.0008 0.9997
dispcorr: -0.018670289 hartree
energy: -1579.987303722132
dipole: 39.93535 -40.21123 -0.27588 28.23117 -25.66730 2.56387 -1.90415 0.50828 -1.39587
magnitude: 2.93223 au
magnitude: 7.45314 debye
