program: Orca
programVersion: 4.2.1
elementType: Cl F F F O N N N C C C C C C C C C C C C C C C H H H H H H H H H H H H H H H
charge: 0
multiplicity: 1
keywords: wb97x-d3
keywords: def2-TZVPP
keywords: def2/J RIJCOSX GRIDX6 NOFINALGRIDX
keywords: grid4 nofinalgrid
keywords: scfconv7
keywords: smallprint printgap noloewdin
keywords: NOSOSCF
formula: C15H15ClF3N3O
InChI: InChI=1S/C15H15ClF3N3O/c1-2-7-23-9-14(22-6-5-20-10-22)21-13-4-3-11(16)8-12(13)15(17,18)19/h3-6,8,10H,2,7,9H2,1H3
38 atoms
Cl -4.645268 1.956441 -0.271107
F  -0.478075 -2.053573 1.489071
F  -2.578155 -2.478667 1.344984
F  -1.26123 -3.044134 -0.252286
O  2.487423 1.447164 0.424063
N  2.713225 -1.235045 -0.590456
N  0.503311 -0.839205 -0.959354
N  4.806318 -1.924823 -0.465378
C  1.530208 -0.569591 -0.271247
C  1.619405 0.427556 0.852122
C  2.365154 2.645914 1.175577
C  -0.697669 -0.165895 -0.747332
C  1.234799 3.536609 0.690601
C  -1.734849 -0.75038 -0.012455
C  -0.907065 1.081133 -1.32859
C  -2.949271 -0.09462 0.133338
C  2.915594 -2.071123 -1.670473
C  1.178323 4.828726 1.491439
C  3.897187 -1.190254 0.095166
C  -1.517625 -2.081333 0.63884
C  -2.115116 1.739372 -1.184387
C  -3.1306 1.145063 -0.454305
C  4.202566 -2.478239 -1.571636
H  1.981714 -0.061693 1.765968
H  0.617172 0.800539 1.076278
H  3.318428 3.168797 1.067623
H  2.242948 2.419266 2.242704
H  1.383772 3.760383 -0.369113
H  0.275046 3.018174 0.771454
H  -0.113868 1.540971 -1.902462
H  -3.753542 -0.536347 0.704417
H  2.146132 -2.285824 -2.389996
H  2.116392 5.38253 1.421278
H  0.383664 5.481541 1.130188
H  0.988762 4.633338 2.548613
H  4.037098 -0.615042 0.994767
H  -2.254641 2.710525 -1.638833
H  4.734335 -3.138904 -2.236843
elementType: Cl F O N C H
totalener: -1579.96738568 hartree
nucrepener: 2151.00262276 hartree
electener: -3730.97000845 hartree
oneelecener: -6443.61404529 hartree
twoeener: 2712.64403684 hartree
cpcmener: -0.02702150 hartree
kineticenergy: 1574.92376357 hartree
xcener: -123.748029168090 hartree
chargesum: -0.0000000
charge: -0.087926 -0.181755 -0.176997 -0.176196 -0.377825 -0.034452 -0.308878 -0.384976 0.249058 -0.015728 0.023416 0.133238 -0.062568 -0.147267 -0.262049 -0.079242 -0.122192 -0.279986 0.070902 0.558256 -0.085711 0.083235 -0.117975 0.143335 0.134279 0.100050 0.082111 0.063651 0.041898 0.153998 0.134116 0.181190 0.084787 0.094588 0.083841 0.163984 0.151286 0.170506
qa: -0.0879 -0.1818 -0.1770 -0.1762 -0.3778 -0.0345 -0.3089 -0.3850 0.2491 -0.0157 0.0234 0.1332 -0.0626 -0.1473 -0.2620 -0.0792 -0.1222 -0.2800 0.0709 0.5583 -0.0857 0.0832 -0.1180 0.1433 0.1343 0.1000 0.0821 0.0637 0.0419 0.1540 0.1341 0.1812 0.0848 0.0946 0.0838 0.1640 0.1513 0.1705
va: 1.2159 1.1119 1.1272 1.1233 1.9218 3.3448 3.0031 3.1140 3.8657 3.9676 3.9215 3.9089 3.8555 3.8330 4.0033 3.9770 3.9041 3.9611 4.0549 4.4265 3.9399 3.8619 4.0382 0.9871 0.9865 0.9963 0.9941 1.0121 1.0128 1.0027 1.0241 1.0068 1.0017 1.0015 1.0007 1.0003 0.9999 0.9986
dispcorr: -0.019173672 hartree
energy: -1579.986559356718
dipole: 27.46011 -28.26637 -0.80626 29.30224 -27.17341 2.12883 2.91212 -2.32777 0.58435
magnitude: 2.35020 au
magnitude: 5.97373 debye
