program: Orca
programVersion: 4.2.1
elementType: Cl F F F O N N N C C C C C C C C C C C C C C C H H H H H H H H H H H H H H H
charge: 0
multiplicity: 1
keywords: wb97x-d3
keywords: def2-TZVPP
keywords: def2/J RIJCOSX GRIDX6 NOFINALGRIDX
keywords: grid4 nofinalgrid
keywords: scfconv7
keywords: smallprint printgap noloewdin
keywords: NOSOSCF
formula: C15H15ClF3N3O
InChI: InChI=1S/C15H15ClF3N3O/c1-2-7-23-9-14(22-6-5-20-10-22)21-13-4-3-11(16)8-12(13)15(17,18)19/h3-6,8,10H,2,7,9H2,1H3
38 atoms
Cl -4.729826 1.891106 -0.295537
F  -1.122626 -2.96713 -0.233568
F  -0.401313 -1.91397 1.497488
F  -2.476882 -2.445333 1.347127
O  2.43513 1.606307 0.454189
N  2.728266 -1.073145 -0.613079
N  0.517314 -0.710531 -0.998561
N  4.834342 -1.723479 -0.490663
C  1.535138 -0.422852 -0.30462
C  1.588085 0.555504 0.839064
C  2.735552 2.503515 1.512134
C  -0.705357 -0.080654 -0.782159
C  1.556071 3.349252 1.960099
C  -1.711329 -0.695321 -0.028565
C  -0.969114 1.148487 -1.379592
C  -2.949117 -0.085664 0.121214
C  2.916878 -1.989211 -1.630184
C  0.909957 4.134867 0.829625
C  3.929521 -0.959474 0.035081
C  -1.433447 -2.005503 0.641238
C  -2.200865 1.760513 -1.231887
C  -3.184195 1.136376 -0.483138
C  4.211545 -2.369955 -1.534759
H  1.952016 0.04497 1.741289
H  0.574431 0.899886 1.061132
H  3.528431 3.148512 1.129047
H  3.146442 1.949998 2.366389
H  0.807455 2.733209 2.466174
H  1.935507 4.035828 2.721177
H  -0.20117 1.626683 -1.972547
H  -3.729052 -0.550771 0.707097
H  2.131003 -2.274817 -2.305937
H  0.135908 4.801143 1.210511
H  1.643222 4.749412 0.303718
H  0.439715 3.481237 0.093452
H  4.086821 -0.313407 0.881968
H  -2.385322 2.718047 -1.698929
H  4.736471 -3.077159 -2.156146
elementType: Cl F O N C H
totalener: -1579.96829177 hartree
nucrepener: 2162.24310679 hartree
electener: -3742.21139856 hartree
oneelecener: -6466.17791794 hartree
twoeener: 2723.96651938 hartree
cpcmener: -0.02659622 hartree
kineticenergy: 1574.92273632 hartree
xcener: -123.748442346448 hartree
chargesum: -0.0000000
charge: -0.089098 -0.175900 -0.181864 -0.176583 -0.376640 -0.035140 -0.302430 -0.382333 0.263769 -0.046441 0.027034 0.104250 -0.125508 -0.143558 -0.231183 -0.085994 -0.123094 -0.261053 0.069288 0.562442 -0.101278 0.089764 -0.116581 0.150966 0.125161 0.104577 0.093213 0.072074 0.078896 0.158553 0.134092 0.182464 0.096205 0.085889 0.068436 0.165471 0.151980 0.170153
qa: -0.0891 -0.1759 -0.1819 -0.1766 -0.3766 -0.0351 -0.3024 -0.3823 0.2638 -0.0464 0.0270 0.1043 -0.1255 -0.1436 -0.2312 -0.0860 -0.1231 -0.2611 0.0693 0.5624 -0.1013 0.0898 -0.1166 0.1510 0.1252 0.1046 0.0932 0.0721 0.0789 0.1586 0.1341 0.1825 0.0962 0.0859 0.0684 0.1655 0.1520 0.1702
va: 1.2141 1.1240 1.1113 1.1279 1.8956 3.3522 3.0088 3.1147 3.8419 4.0024 3.8781 3.9373 3.8677 3.8350 3.9776 3.9869 3.8998 3.9303 4.0598 4.4203 3.9605 3.8530 4.0351 0.9840 0.9928 0.9946 1.0038 1.0046 1.0132 1.0007 1.0244 1.0069 1.0054 1.0031 1.0067 0.9983 1.0000 0.9985
dispcorr: -0.019596590 hartree
energy: -1579.987888362555
dipole: 27.71138 -28.32457 -0.61319 26.73290 -24.83590 1.89700 3.93442 -3.12899 0.80543
magnitude: 2.15019 au
magnitude: 5.46535 debye
