program: Gaussian 09
title: 000029997
version: EM64L-G09RevD.01
frameworkgroup: C1[X(C12H29NO3PS)]
method: RPBEPBE
basis: SDD
operation: Freq
keyword: #p
keyword: freq=noraman
keyword: PBEPBE/SDD
title: #p freq=noraman PBEPBE/SDD
converged: NO YES NO NO
title: Mulliken charges:
elementType: S P O O O N C C C C C C C C C C C C H H H H H H H H H H H H H H H H H H H H H H H H H H H H H
charge: 0.071941 1.095515 -0.475723 -0.497985 -0.637125 -0.111304 -0.264505 -0.289870 -0.300344 -0.292556 -0.813903 -0.703768 -0.708094 -0.736478 -0.232772 -0.232012 -0.641285 -0.641107 0.306455 0.265639 0.248828 0.260200 0.269325 0.260526 0.245491 0.252702 0.326934 0.301795 0.266191 0.242838 0.242819 0.266841 0.246576 0.239899 0.255763 0.322921 0.231946 0.230157 0.240921 0.247807 0.230989 0.241227 0.232244 0.227881 0.235426 0.242911 0.228127
chargesum: 1.00000
title: Mulliken charges with hydrogens summed into heavy atoms:
elementType: S P O O O N C C C C C C C C C C C C
charge: 0.071941 1.095515 -0.475723 -0.497985 -0.637125 -0.111304 0.307589 0.219157 0.229507 0.205637 -0.185174 0.048080 0.045221 0.074152 0.238306 0.246784 0.060066 0.065357
polarizability: 2.43576846e+02 3.11213609e+00 1.81089257e+02 -7.97893981e+00 2.46541787e+00 1.68542838e+02
1716.lowfreq: -6.3104 -0.0009 -0.0005 0.0014 3.0256 8.1389 11.2059 16.5385 27.3521
frequency: 8.6365 16.4041 27.3102 42.8456 45.0085 58.8448 68.3062 79.1127 96.8087 102.8541 114.2201 115.8938 133.2792 143.3727 179.9778 195.3099 204.1604 215.2570 227.4858 234.2109 239.5654 255.7023 269.0352 280.0889 282.1899 290.2358 292.2383 303.9981 328.7446 357.9084 366.0869 380.5135 411.5663 440.4603 469.0737 483.8273 545.5888 632.0374 651.1831 692.3851 710.7230 756.9940 777.1089 788.0688 807.5689 809.5051 811.5257 847.7218 855.8639 862.2579 871.8638 903.4622 999.1177 1005.6951 1007.7950 1019.0489 1023.2640 1024.8252 1046.1529 1058.0942 1077.4700 1097.2678 1102.5625 1104.0922 1120.7903 1124.7868 1130.5213 1155.3564 1167.2155 1185.3642 1227.4200 1250.6504 1253.4268 1277.0715 1290.1837 1291.8467 1305.8471 1339.2385 1351.2471 1352.2277 1353.5754 1367.5823 1376.4407 1384.5189 1399.5206 1399.9676 1409.3326 1415.5070 1427.7983 1439.8554 1456.0742 1457.2969 1464.7294 1470.9297 1474.1023 1474.6422 1475.7775 1477.0055 1482.7909 1484.8275 1484.9448 1487.3498 1492.5233 1495.2171 1497.2392 1505.9861 2986.3772 2993.0378 3000.7209 3002.0410 3005.5066 3006.0034 3006.4998 3034.6656 3035.4284 3041.6194 3042.7126 3050.0535 3062.8396 3075.4631 3078.7956 3087.5480 3091.6596 3094.5066 3095.6608 3097.3480 3098.2581 3098.2915 3110.7789 3111.8473 3116.6978 3118.1027 3119.9316 3121.5079 3133.4778
redmass: 4.8482 3.5192 3.3035 1.7729 3.3714 3.6103 2.2351 2.4587 3.8856 2.6396 3.3929 2.8526 2.8557 2.1730 2.8993 3.7070 4.1567 2.1483 1.1729 1.3112 1.2347 1.7030 2.9208 3.9439 3.6417 1.5927 3.3754 2.7652 2.1126 2.7755 2.6081 4.5272 6.4082 2.9427 2.9235 11.5054 2.7177 6.1876 3.5576 5.9436 4.2294 1.2269 1.3703 1.4772 1.0896 1.1999 1.0953 4.9776 1.9206 5.1541 1.7748 2.4606 2.1685 2.5912 1.8537 2.5274 3.3579 2.2891 2.6031 3.2653 1.8404 1.7993 2.2593 2.2979 2.1816 1.3823 1.4095 1.6997 1.9065 1.8634 1.2885 1.1604 1.1495 1.1649 1.1121 1.1312 1.1114 1.1781 1.2542 1.2150 1.2455 1.2854 1.2882 1.2618 1.2247 1.2259 1.2133 1.1919 1.1688 1.0968 1.0390 1.0394 1.0705 1.0637 1.0627 1.0446 1.0667 1.0540 1.0642 1.0682 1.0568 1.0820 1.0594 1.0579 1.0572 1.0621 1.0391 1.0557 1.0374 1.0381 1.0375 1.0377 1.0567 1.0603 1.0598 1.0604 1.0608 1.0574 1.1077 1.1085 1.0999 1.1016 1.1028 1.0995 1.0980 1.0977 1.0996 1.0991 1.1039 1.1057 1.1035 1.1024 1.1030 1.1040 1.1078
irintensity: 1.8962 0.0423 1.2733 1.4545 0.6041 2.8247 2.9068 1.4393 6.0217 1.6291 1.4171 0.5954 1.6515 0.4059 2.3456 2.7624 24.9233 2.6824 0.6101 1.2626 0.5225 0.1275 1.4814 18.1548 15.0858 0.3153 0.7087 0.5066 0.0332 0.8681 1.3483 10.1918 9.0158 3.6483 4.4420 118.0426 0.7879 66.2570 0.8908 66.3753 6.2619 14.7985 21.5639 50.9697 3.4543 4.3846 2.1130 250.7803 15.9078 186.7876 0.4078 6.1946 119.5779 165.0101 25.2891 19.1766 65.7147 21.4510 7.5703 6.2086 1.4400 10.1003 13.3860 14.7832 1.5562 5.3725 6.5169 4.7731 8.7525 7.6399 1.1546 0.2807 0.3407 9.9941 4.2728 1.4833 1.5345 4.4510 9.0976 0.3441 9.7743 3.4547 1.6770 2.3508 22.6464 31.1599 25.0263 35.2281 23.8122 11.4168 15.5591 15.0105 7.3795 13.6682 7.7896 31.4242 30.9808 3.8924 25.8223 28.7028 1.2196 2.6626 10.7643 9.7924 14.4153 3.0306 34.7829 17.8375 8.7669 11.1227 4.1126 5.2257 23.9678 14.6412 6.4171 7.3159 6.4744 5.1875 12.1959 7.3166 12.5336 5.7078 2.1264 4.5993 3.2651 14.0398 2.6567 21.9501 17.8007 2.5644 22.5265 27.2383 27.6717 19.9054 0.8423
temp: 298.150 k
press: 1.00000 atm
elementType: 16 15 8 8 8 7 6 6 6 6 6 6 6 6 6 6 6 6 1 1 1 1 1 1 1 1 1 1 1 1 1 1 1 1 1 1 1 1 1 1 1 1 1 1 1 1 1
symmnumber: 1
zpe: 1070932.2 jmol-1
zpe.correction: 0.407897 hartree
zpe.thermalcorrener: 0.433350 hartree
zpe.thermalcorrenthalpy: 0.434294 hartree
zpe.thermalcorrgfe: 0.349232 hartree
zpe.sumelectzpe: -1492.618302 hartree
zpe.sumelectthermal: -1492.592849 hartree
zpe.sumelectthermalent: -1492.591905 hartree
zpe.sumelectthermalfe: -1492.676967 hartree
dipole: -8.5839 0.6394 0.1415
dipole: 8.6088
quadrupole: -38.9175 -106.3628 -123.3399
quadrupole: 2.4360 -3.2618 1.3289
quadrupole: 50.6225 -16.8227 -33.7998 2.4360 -3.2618 1.3289
hfenergy: -1493.0261987 hartree
pointgroup: C01 [X(C12H29N1O3P1S1)]
dipole: -3.3754899 0.273154 0.0552603 debye
polarizability: 241.2919526|-13.996051|182.0086352|4.0433384|4.8097401|169.9083534 unknown
InChI: InChI=1S/C8H19NS.C4H10O3P/c1-4-9(5-2,6-3)7-8-10;1-3-6-8(5)7-4-2/h4-8H2,1-3H3;3-4H2,1-2H3
charge 1 multiplicity 1
47 atoms
S  0.765676 0.152526 -1.971262
P  1.922069 -0.345289 -0.016927
O  2.034718 -2.060754 0.069034
O  3.477794 0.24957 -0.435536
O  1.190408 0.237319 1.274132
N  -2.913063 0.361948 0.186477
C  -1.588431 -0.133963 -0.461212
C  -3.817878 0.956038 -0.926126
C  -3.596314 -0.847125 0.879084
C  -2.64301 1.462018 1.254168
C  -0.690301 0.960688 -1.056478
C  -5.241227 1.336836 -0.498909
C  -4.047974 -1.976095 -0.055366
C  -1.728596 1.053417 2.415438
C  2.658111 -2.833925 -1.062844
C  4.508999 0.465255 0.655539
C  2.744021 -4.278824 -0.586778
C  5.741048 1.009427 -0.053423
H  -1.036482 -0.668816 0.329174
H  -1.878181 -0.852343 -1.244676
H  -3.286668 1.845496 -1.304007
H  -3.842385 0.206273 -1.734407
H  -2.863943 -1.225526 1.610166
H  -4.451123 -0.43308 1.439555
H  -3.636476 1.758722 1.629088
H  -2.218297 2.318187 0.702962
H  -0.265978 1.618761 -0.283573
H  -1.179132 1.561105 -1.840698
H  -5.759403 1.737738 -1.388049
H  -5.267454 2.128433 0.267756
H  -5.831716 0.476038 -0.144185
H  -4.519878 -2.755195 0.569123
H  -3.210534 -2.458775 -0.585536
H  -4.802399 -1.655352 -0.792758
H  -1.591561 1.947921 3.049858
H  -0.722759 0.73117 2.093775
H  -2.176452 0.27818 3.059333
H  2.007372 -2.728179 -1.95231
H  3.653478 -2.406423 -1.28222
H  4.091261 1.181211 1.38544
H  4.702847 -0.502794 1.153828
H  3.379883 -4.362281 0.309822
H  1.744218 -4.678072 -0.348227
H  3.185514 -4.902185 -1.385877
H  6.124903 0.289334 -0.79499
H  5.512557 1.957939 -0.566639
H  6.536739 1.199249 0.69046
