program: Orca
programVersion: 4.2.1
elementType: Cl F F F O N N N C C C C C C C C C C C C C C C H H H H H H H H H H H H H H H
charge: 0
multiplicity: 1
keywords: wb97x-d3
keywords: def2-TZVPP
keywords: def2/J RIJCOSX GRIDX6 NOFINALGRIDX
keywords: grid4 nofinalgrid
keywords: scfconv7
keywords: smallprint printgap noloewdin
keywords: NOSOSCF
formula: C15H15ClF3N3O
InChI: InChI=1S/C15H15ClF3N3O/c1-2-7-23-9-14(22-6-5-20-10-22)21-13-4-3-11(16)8-12(13)15(17,18)19/h3-6,8,10H,2,7,9H2,1H3
38 atoms
Cl -5.373076 1.110792 -0.473841
F  -0.226287 -1.107545 1.797882
F  -2.149527 -2.033599 2.023169
F  -0.807427 -2.717811 0.495897
O  2.240773 2.09656 0.376688
N  2.526448 -0.316254 -1.076746
N  0.270278 -0.511198 -1.001426
N  4.035351 -1.909796 -1.310525
C  1.268574 0.257266 -0.876851
C  1.246565 1.73232 -0.533527
C  2.006271 1.628318 1.695059
C  -1.037777 -0.075606 -0.842089
C  3.186764 1.989042 2.567916
C  -1.845981 -0.63017 0.158456
C  -1.605597 0.833127 -1.732092
C  -3.176492 -0.256065 0.275169
C  3.713637 0.311342 -1.39847
C  4.47923 1.301858 2.15237
C  2.792248 -1.658576 -1.042739
C  -1.259883 -1.622202 1.115847
C  -2.934316 1.201841 -1.626086
C  -3.710721 0.655982 -0.618741
C  4.617626 -0.685446 -1.547718
H  0.24767 1.991365 -0.164291
H  1.405433 2.308136 -1.449586
H  1.870061 0.539286 1.705871
H  1.083904 2.073506 2.088827
H  3.317194 3.074539 2.579336
H  2.928357 1.70203 3.589733
H  -1.001824 1.245052 -2.530164
H  -3.802499 -0.66871 1.053264
H  3.812834 1.375136 -1.514628
H  4.805379 1.60824 1.158889
H  5.284781 1.534928 2.849324
H  4.35995 0.216704 2.137351
H  2.035344 -2.384322 -0.795551
H  -3.353169 1.910209 -2.327095
H  5.658884 -0.592388 -1.810022
elementType: Cl F O N C H
totalener: -1579.96842782 hartree
nucrepener: 2164.46549252 hartree
electener: -3744.43392034 hartree
oneelecener: -6470.64012167 hartree
twoeener: 2726.20620133 hartree
cpcmener: -0.02764263 hartree
kineticenergy: 1574.92440702 hartree
xcener: -123.749276172194 hartree
chargesum: 0.0000000
charge: -0.088890 -0.176196 -0.178491 -0.176614 -0.375117 0.002020 -0.308145 -0.381820 0.178735 0.018093 -0.005011 0.132138 -0.092940 -0.176569 -0.181447 -0.079478 -0.135213 -0.257258 0.060881 0.553754 -0.112385 0.085370 -0.120830 0.127810 0.157359 0.084682 0.106540 0.063688 0.065947 0.163878 0.133987 0.174631 0.075929 0.103690 0.074779 0.163375 0.149493 0.169625
qa: -0.0889 -0.1762 -0.1785 -0.1766 -0.3751 0.0020 -0.3081 -0.3818 0.1787 0.0181 -0.0050 0.1321 -0.0929 -0.1766 -0.1814 -0.0795 -0.1352 -0.2573 0.0609 0.5538 -0.1124 0.0854 -0.1208 0.1278 0.1574 0.0847 0.1065 0.0637 0.0659 0.1639 0.1340 0.1746 0.0759 0.1037 0.0748 0.1634 0.1495 0.1696
va: 1.2145 1.1133 1.1242 1.1210 1.9278 3.2841 3.0021 3.1152 3.8455 3.9311 3.9064 3.8965 3.9204 3.8547 3.9860 3.9731 3.9179 3.9026 4.0300 4.4181 3.9882 3.8583 4.0210 0.9952 0.9805 0.9919 0.9999 1.0150 1.0122 0.9924 1.0240 1.0012 1.0123 1.0029 1.0041 1.0134 1.0016 1.0000
dispcorr: -0.020189166 hartree
energy: -1579.988616987252
dipole: 37.04272 -37.75524 -0.71252 18.92564 -16.32425 2.60139 2.69189 -2.94009 -0.24820
magnitude: 2.70860 au
magnitude: 6.88471 debye
