program: Orca
programVersion: 4.2.1
elementType: Cl F F F O N N N C C C C C C C C C C C C C C C H H H H H H H H H H H H H H H
charge: 0
multiplicity: 1
keywords: wb97x-d3
keywords: def2-TZVPP
keywords: def2/J RIJCOSX GRIDX6 NOFINALGRIDX
keywords: grid4 nofinalgrid
keywords: scfconv7
keywords: smallprint printgap noloewdin
keywords: NOSOSCF
formula: C15H15ClF3N3O
InChI: InChI=1S/C15H15ClF3N3O/c1-2-7-23-9-14(22-6-5-20-10-22)21-13-4-3-11(16)8-12(13)15(17,18)19/h3-6,8,10H,2,7,9H2,1H3
38 atoms
Cl -5.007039 1.646674 0.340711
F  -1.077909 -2.96006 0.608537
F  -2.6823 -2.810021 -0.809109
F  -0.698911 -2.206372 -1.369793
O  2.267158 1.3258 -1.565238
N  2.641768 -0.878273 0.300954
N  0.451015 -0.542959 0.787212
N  4.162822 -1.930088 1.503405
C  1.391623 -0.352548 -0.032774
C  1.286771 0.353907 -1.370153
C  2.115178 2.480602 -0.760166
C  -0.824719 -0.019935 0.618203
C  3.197296 3.472852 -1.126959
C  -1.869085 -0.799858 0.107467
C  -1.106035 1.273233 1.052896
C  -3.154687 -0.282955 0.021318
C  3.783589 -0.945543 -0.476659
C  3.089438 4.747307 -0.304591
C  2.944215 -1.493856 1.487214
C  -1.586382 -2.193965 -0.36115
C  -2.384785 1.792024 0.966676
C  -3.403003 1.008719 0.449417
C  4.698348 -1.593472 0.28322
H  0.27879 0.771238 -1.469387
H  1.401508 -0.389871 -2.163599
H  2.192134 2.227958 0.307006
H  1.122087 2.922996 -0.918447
H  4.176496 3.012747 -0.97029
H  3.123445 3.71139 -2.191264
H  -0.311929 1.877216 1.471861
H  -3.964547 -0.876868 -0.378257
H  3.853614 -0.542229 -1.469754
H  3.879021 5.450063 -0.571293
H  2.135127 5.251804 -0.467262
H  3.179107 4.545933 0.764508
H  2.22282 -1.581624 2.282653
H  -2.579015 2.801078 1.303668
H  5.715306 -1.83842 0.020495
elementType: Cl F O N C H
totalener: -1579.97879017 hartree
nucrepener: 2139.19460051 hartree
electener: -3719.17339068 hartree
oneelecener: -6419.79762548 hartree
twoeener: 2700.62423480 hartree
cpcmener: -0.02251834 hartree
kineticenergy: 1574.92371957 hartree
xcener: -123.748448027788 hartree
chargesum: 0.0000000
charge: -0.087200 -0.173756 -0.176280 -0.181332 -0.364014 -0.020968 -0.296343 -0.372355 0.170881 0.036571 0.026554 0.086201 -0.087055 -0.135257 -0.205960 -0.077652 -0.119738 -0.276210 0.065849 0.558849 -0.101501 0.076270 -0.120762 0.130235 0.142970 0.081128 0.090587 0.063956 0.063875 0.157660 0.133912 0.175265 0.094269 0.081484 0.082181 0.163862 0.147984 0.165841
qa: -0.0872 -0.1738 -0.1763 -0.1813 -0.3640 -0.0210 -0.2963 -0.3724 0.1709 0.0366 0.0266 0.0862 -0.0871 -0.1353 -0.2060 -0.0777 -0.1197 -0.2762 0.0658 0.5588 -0.1015 0.0763 -0.1208 0.1302 0.1430 0.0811 0.0906 0.0640 0.0639 0.1577 0.1339 0.1753 0.0943 0.0815 0.0822 0.1639 0.1480 0.1658
va: 1.2157 1.1272 1.1284 1.1128 1.9398 3.3124 2.9821 3.1186 3.8458 3.9156 3.8874 3.9622 3.9206 3.8229 4.0031 3.9755 3.9060 3.9506 4.0217 4.4237 4.0003 3.8687 4.0352 0.9978 0.9907 0.9862 0.9906 1.0101 1.0117 0.9975 1.0240 1.0064 1.0034 1.0018 1.0012 1.0144 1.0022 1.0004
dispcorr: -0.019026089 hartree
energy: -1579.997816260735
dipole: 35.70050 -36.07246 -0.37196 30.88881 -28.59436 2.29445 -3.06052 2.11217 -0.94834
magnitude: 2.51042 au
magnitude: 6.38098 debye
