program: Orca
programVersion: 4.2.1
elementType: Cl F F F O N N N C C C C C C C C C C C C C C C H H H H H H H H H H H H H H H
charge: 0
multiplicity: 1
keywords: wb97x-d3
keywords: def2-TZVPP
keywords: def2/J RIJCOSX GRIDX6 NOFINALGRIDX
keywords: grid4 nofinalgrid
keywords: scfconv7
keywords: smallprint printgap noloewdin
keywords: NOSOSCF
formula: C15H15ClF3N3O
InChI: InChI=1S/C15H15ClF3N3O/c1-2-7-23-9-14(22-6-5-20-10-22)21-13-4-3-11(16)8-12(13)15(17,18)19/h3-6,8,10H,2,7,9H2,1H3
38 atoms
Cl -4.744614 1.799997 -0.235412
F  -1.841524 -1.778727 2.06989
F  -0.779973 -2.678468 0.433889
F  0.186504 -1.207129 1.664079
O  0.960331 1.643327 0.293474
N  2.736356 -1.141511 -1.199966
N  0.524245 -0.665429 -1.191957
N  4.782497 -1.935201 -1.417265
C  1.67019 -0.32142 -0.807622
C  2.071507 0.854476 0.046592
C  1.252071 2.906408 0.859145
C  -0.678623 -0.037926 -0.912595
C  1.675919 2.85315 2.316652
C  -1.473353 -0.447724 0.163279
C  -1.185647 0.914064 -1.79419
C  -2.721723 0.124865 0.372616
C  2.631152 -2.299248 -1.942641
C  0.640718 2.20995 3.225359
C  4.065227 -0.979478 -0.916297
C  -0.980991 -1.522819 1.080231
C  -2.42733 1.481738 -1.591341
C  -3.18697 1.08941 -0.50006
C  3.897779 -2.76459 -2.063369
H  2.853535 1.415932 -0.485701
H  2.535574 0.466236 0.964188
H  0.3309 3.485649 0.76345
H  2.020054 3.41878 0.263395
H  2.638826 2.343579 2.419708
H  1.85557 3.885191 2.630956
H  -0.591781 1.214763 -2.646909
H  -3.336401 -0.177457 1.208675
H  1.686746 -2.66955 -2.300025
H  -0.31194 2.741949 3.179271
H  0.448297 1.172216 2.954025
H  0.970868 2.220411 4.264921
H  4.446537 -0.150618 -0.341564
H  -2.796766 2.227484 -2.282171
H  4.226469 -3.653876 -2.57765
elementType: Cl F O N C H
totalener: -1579.97516726 hartree
nucrepener: 2195.11866037 hartree
electener: -3775.09382763 hartree
oneelecener: -6532.49099252 hartree
twoeener: 2757.39716489 hartree
cpcmener: -0.02371589 hartree
kineticenergy: 1574.92938113 hartree
xcener: -123.753434851967 hartree
chargesum: 0.0000000
charge: -0.097260 -0.181283 -0.177870 -0.185240 -0.319046 -0.035830 -0.331129 -0.372504 0.244928 -0.010483 0.003338 0.236775 -0.112851 -0.190494 -0.224064 -0.095584 -0.115632 -0.260364 0.059665 0.577389 -0.114188 0.077734 -0.116592 0.127296 0.121970 0.087360 0.090886 0.065814 0.076490 0.141830 0.129715 0.180880 0.076923 0.073377 0.095614 0.161496 0.144722 0.166215
qa: -0.0973 -0.1813 -0.1779 -0.1852 -0.3190 -0.0358 -0.3311 -0.3725 0.2449 -0.0105 0.0033 0.2368 -0.1129 -0.1905 -0.2241 -0.0956 -0.1156 -0.2604 0.0597 0.5774 -0.1142 0.0777 -0.1166 0.1273 0.1220 0.0874 0.0909 0.0658 0.0765 0.1418 0.1297 0.1809 0.0769 0.0734 0.0956 0.1615 0.1447 0.1662
va: 1.2063 1.1212 1.1183 1.1041 1.9432 3.3398 3.0453 3.1166 3.8962 3.9834 3.9074 3.8232 3.8601 3.8551 4.0290 3.9777 3.8927 3.9277 4.0660 4.3765 3.9852 3.8361 4.0355 0.9887 0.9783 0.9956 1.0011 1.0061 1.0128 1.0038 1.0256 1.0074 1.0030 1.0126 1.0061 0.9949 1.0021 0.9996
dispcorr: -0.019784382 hartree
energy: -1579.994951642154
dipole: 24.79103 -24.30244 0.48859 19.75582 -17.60941 2.14641 3.93783 -3.92743 0.01039
magnitude: 2.20134 au
magnitude: 5.59536 debye
