program: Orca
programVersion: 4.2.1
elementType: Cl F F F O N N N C C C C C C C C C C C C C C C H H H H H H H H H H H H H H H
charge: 0
multiplicity: 1
keywords: wb97x-d3
keywords: def2-TZVPP
keywords: def2/J RIJCOSX GRIDX6 NOFINALGRIDX
keywords: grid4 nofinalgrid
keywords: scfconv7
keywords: smallprint printgap noloewdin
keywords: NOSOSCF
formula: C15H15ClF3N3O
InChI: InChI=1S/C15H15ClF3N3O/c1-2-7-23-9-14(22-6-5-20-10-22)21-13-4-3-11(16)8-12(13)15(17,18)19/h3-6,8,10H,2,7,9H2,1H3
38 atoms
Cl -4.953275 1.643174 -0.610762
F  -0.959817 -2.760671 0.354217
F  -0.221933 -1.306413 1.758679
F  -2.259678 -1.971357 1.867361
O  2.707769 1.643097 0.519653
N  2.728673 -0.756243 -1.031991
N  0.470381 -0.637508 -0.965862
N  4.833777 -1.26078 -1.45103
C  1.561985 -0.014817 -0.836466
C  1.741591 1.445452 -0.468611
C  2.377916 1.137378 1.804551
C  -0.777109 -0.047151 -0.850201
C  1.277765 1.908005 2.514331
C  -1.695777 -0.540178 0.087401
C  -1.191429 0.957769 -1.722528
C  -2.97487 -0.0110 0.164763
C  2.784762 -2.129284 -1.1719
C  1.580091 3.390922 2.665138
C  4.005925 -0.293266 -1.214613
C  -1.284913 -1.643943 1.014189
C  -2.470358 1.479984 -1.656297
C  -3.353004 0.995814 -0.707011
C  4.084711 -2.413162 -1.420337
H  0.767028 1.85643 -0.189266
H  2.066773 1.99703 -1.354583
H  3.302419 1.204774 2.381095
H  2.121101 0.072129 1.753054
H  0.314324 1.770702 2.015004
H  1.163186 1.449304 3.500245
H  -0.509393 1.321911 -2.479939
H  -3.683075 -0.377089 0.894425
H  1.913387 -2.751571 -1.072345
H  1.648867 3.894298 1.700309
H  0.799758 3.892647 3.237414
H  2.524669 3.551662 3.189133
H  4.266614 0.75083 -1.172019
H  -2.769021 2.258243 -2.345131
H  4.52877 -3.38327 -1.580462
elementType: Cl F O N C H
totalener: -1579.97747402 hartree
nucrepener: 2175.33943634 hartree
electener: -3755.31691036 hartree
oneelecener: -6492.23836623 hartree
twoeener: 2736.92145586 hartree
cpcmener: -0.02332231 hartree
kineticenergy: 1574.92632194 hartree
xcener: -123.751463935653 hartree
chargesum: 0.0000000
charge: -0.085622 -0.174094 -0.176452 -0.178438 -0.380524 -0.031462 -0.300179 -0.374171 0.195998 -0.019752 0.018995 0.133348 -0.112762 -0.180785 -0.181145 -0.077005 -0.127209 -0.262300 0.069886 0.554080 -0.112815 0.083834 -0.115298 0.130829 0.160414 0.113367 0.089621 0.052884 0.081251 0.161565 0.133357 0.179853 0.079632 0.094416 0.081666 0.161245 0.147729 0.166042
qa: -0.0856 -0.1741 -0.1765 -0.1784 -0.3805 -0.0315 -0.3002 -0.3742 0.1960 -0.0198 0.0190 0.1333 -0.1128 -0.1808 -0.1811 -0.0770 -0.1272 -0.2623 0.0699 0.5541 -0.1128 0.0838 -0.1153 0.1308 0.1604 0.1134 0.0896 0.0529 0.0813 0.1616 0.1334 0.1799 0.0796 0.0944 0.0817 0.1612 0.1477 0.1660
va: 1.2182 1.1242 1.1123 1.1242 1.9095 3.3256 2.9955 3.1194 3.8565 3.9671 3.8699 3.8786 3.8902 3.8343 3.9560 3.9710 3.9073 3.9405 4.0442 4.4162 3.9927 3.8696 4.0448 0.9829 0.9814 0.9923 1.0063 1.0069 1.0115 0.9921 1.0237 1.0053 1.0070 1.0051 1.0020 1.0079 1.0020 1.0003
dispcorr: -0.020185208 hartree
energy: -1579.997659227480
dipole: 27.19170 -28.21447 -1.02277 19.79554 -18.20813 1.58741 5.04684 -5.13114 -0.08430
magnitude: 1.89025 au
magnitude: 4.80463 debye
