program: Orca
programVersion: 4.2.1
elementType: Cl F F F O N N N C C C C C C C C C C C C C C C H H H H H H H H H H H H H H H
charge: 0
multiplicity: 1
keywords: wb97x-d3
keywords: def2-TZVPP
keywords: def2/J RIJCOSX GRIDX6 NOFINALGRIDX
keywords: grid4 nofinalgrid
keywords: scfconv7
keywords: smallprint printgap noloewdin
keywords: NOSOSCF
formula: C15H15ClF3N3O
InChI: InChI=1S/C15H15ClF3N3O/c1-2-7-23-9-14(22-6-5-20-10-22)21-13-4-3-11(16)8-12(13)15(17,18)19/h3-6,8,10H,2,7,9H2,1H3
38 atoms
Cl -5.365184 1.237252 -0.418935
F  -2.233598 -2.08001 1.969236
F  -0.905122 -2.72993 0.414965
F  -0.282004 -1.20313 1.797004
O  2.322002 2.014612 0.424498
N  2.501827 -0.351059 -1.11994
N  0.247581 -0.480787 -0.960277
N  4.609542 -0.612229 -1.712187
C  1.269592 0.256148 -0.870566
C  1.310027 1.724753 -0.490169
C  2.065397 1.536617 1.734485
C  -1.048331 -0.02014 -0.794494
C  3.26841 1.808898 2.609547
C  -1.878982 -0.599388 0.174402
C  -1.590886 0.935298 -1.652057
C  -3.202224 -0.202037 0.294388
C  2.719934 -1.711703 -1.207582
C  4.516551 1.050943 2.181621
C  3.687659 0.255915 -1.440014
C  -1.326317 -1.652552 1.086427
C  -2.913237 1.325612 -1.543769
C  -3.710225 0.756638 -0.565928
C  4.020041 -1.845095 -1.562249
H  0.3239 2.013159 -0.107737
H  1.489165 2.326025 -1.385877
H  1.861682 0.457672 1.725853
H  1.173331 2.029894 2.142086
H  3.465977 2.884275 2.638133
H  2.994236 1.521863 3.627742
H  -0.974521 1.362857 -2.432356
H  -3.844806 -0.634593 1.048002
H  1.947435 -2.430814 -0.999735
H  5.33178 1.21321 2.887835
H  4.330307 -0.024456 2.138296
H  4.870194 1.364052 1.19933
H  3.812088 1.325155 -1.471146
H  -3.311902 2.067582 -2.22196
H  4.570618 -2.759324 -1.718783
elementType: Cl F O N C H
totalener: -1579.97899382 hartree
nucrepener: 2159.81287464 hartree
electener: -3739.79186846 hartree
oneelecener: -6461.34663289 hartree
twoeener: 2721.55476442 hartree
cpcmener: -0.02346159 hartree
kineticenergy: 1574.92072542 hartree
xcener: -123.748415846181 hartree
chargesum: -0.0000000
charge: -0.086426 -0.178430 -0.174764 -0.176001 -0.365453 -0.007047 -0.301943 -0.368348 0.183338 0.008279 -0.009344 0.144589 -0.091493 -0.179297 -0.189418 -0.076834 -0.130304 -0.257641 0.047666 0.551128 -0.110902 0.082757 -0.117277 0.126927 0.153665 0.086170 0.102137 0.063691 0.065654 0.161932 0.133508 0.180006 0.102682 0.075357 0.077431 0.161177 0.147217 0.165609
qa: -0.0864 -0.1784 -0.1748 -0.1760 -0.3655 -0.0070 -0.3019 -0.3683 0.1833 0.0083 -0.0093 0.1446 -0.0915 -0.1793 -0.1894 -0.0768 -0.1303 -0.2576 0.0477 0.5511 -0.1109 0.0828 -0.1173 0.1269 0.1537 0.0862 0.1021 0.0637 0.0657 0.1619 0.1335 0.1800 0.1027 0.0754 0.0774 0.1612 0.1472 0.1656
va: 1.2171 1.1240 1.1233 1.1143 1.9344 3.3048 2.9976 3.1039 3.8295 3.9403 3.9165 3.8879 3.9197 3.8591 3.9857 3.9665 3.9088 3.9077 4.0470 4.4230 3.9897 3.8694 4.0459 0.9941 0.9815 0.9900 1.0000 1.0150 1.0119 0.9929 1.0238 1.0047 1.0030 1.0042 1.0110 1.0056 1.0026 1.0004
dispcorr: -0.019924459 hartree
energy: -1579.998918280716
dipole: 36.76244 -37.84090 -1.07846 15.92265 -14.42177 1.50089 3.28302 -3.24574 0.03728
magnitude: 1.84855 au
magnitude: 4.69864 debye
