program: Orca
programVersion: 4.2.1
elementType: Cl F F F O N N N C C C C C C C C C C C C C C C H H H H H H H H H H H H H H H
charge: 0
multiplicity: 1
keywords: wb97x-d3
keywords: def2-TZVPP
keywords: def2/J RIJCOSX GRIDX6 NOFINALGRIDX
keywords: grid4 nofinalgrid
keywords: scfconv7
keywords: smallprint printgap noloewdin
keywords: NOSOSCF
formula: C15H15ClF3N3O
InChI: InChI=1S/C15H15ClF3N3O/c1-2-7-23-9-14(22-6-5-20-10-22)21-13-4-3-11(16)8-12(13)15(17,18)19/h3-6,8,10H,2,7,9H2,1H3
38 atoms
Cl -5.296739 1.157879 0.702272
F  -0.309579 -0.887463 -2.071573
F  -1.060362 -2.691546 -1.170951
F  -2.304588 -1.555919 -2.50032
O  2.332584 1.514943 -0.289262
N  2.461427 -1.023942 0.861578
N  0.201714 -0.960786 0.758034
N  4.578097 -1.528473 1.217411
C  1.27347 -0.294826 0.782174
C  1.411279 1.20439 0.715062
C  2.607695 2.899808 -0.374972
C  -1.061828 -0.393417 0.721156
C  3.70012 3.127259 -1.397409
C  -1.910189 -0.649029 -0.364114
C  -1.555539 0.341267 1.796944
C  -3.208898 -0.163512 -0.370783
C  2.566906 -2.394239 0.727793
C  4.012777 4.607828 -1.551567
C  3.717002 -0.563076 1.157839
C  -1.39749 -1.446348 -1.525084
C  -2.853142 0.820962 1.797732
C  -3.671844 0.565657 0.711491
C  3.873701 -2.676568 0.941651
H  1.729618 1.581593 1.698447
H  0.429415 1.647054 0.5126
H  2.923091 3.285339 0.604932
H  1.699293 3.45014 -0.656839
H  4.600385 2.587941 -1.09109
H  3.3917 2.711575 -2.360209
H  -0.922226 0.521701 2.655948
H  -3.866436 -0.349503 -1.208259
H  1.721584 -3.014124 0.48723
H  4.809719 4.76596 -2.278337
H  3.141318 5.168159 -1.895082
H  4.338991 5.05001 -0.60826
H  3.935636 0.476691 1.332325
H  -3.216061 1.388345 2.644033
H  4.35201 -3.642787 0.913625
elementType: Cl F O N C H
totalener: -1579.97948549 hartree
nucrepener: 2111.37062883 hartree
electener: -3691.35011432 hartree
oneelecener: -6364.74849855 hartree
twoeener: 2673.39838423 hartree
cpcmener: -0.02563547 hartree
kineticenergy: 1574.92382418 hartree
xcener: -123.747580902542 hartree
chargesum: 0.0000000
charge: -0.087152 -0.179155 -0.175344 -0.178850 -0.358157 -0.036821 -0.313668 -0.376297 0.262469 -0.030951 0.025735 0.121170 -0.076435 -0.165423 -0.199357 -0.077066 -0.118878 -0.277795 0.071348 0.552604 -0.103086 0.079420 -0.119669 0.141162 0.129276 0.075908 0.084892 0.061924 0.062283 0.160090 0.133677 0.179870 0.095221 0.081634 0.080790 0.160901 0.147638 0.166090
qa: -0.0872 -0.1792 -0.1753 -0.1789 -0.3582 -0.0368 -0.3137 -0.3763 0.2625 -0.0310 0.0257 0.1212 -0.0764 -0.1654 -0.1994 -0.0771 -0.1189 -0.2778 0.0713 0.5526 -0.1031 0.0794 -0.1197 0.1412 0.1293 0.0759 0.0849 0.0619 0.0623 0.1601 0.1337 0.1799 0.0952 0.0816 0.0808 0.1609 0.1476 0.1661
va: 1.2165 1.1164 1.1236 1.1233 1.9503 3.3362 3.0106 3.1175 3.8883 4.0063 3.8941 3.9153 3.8987 3.8540 3.9963 3.9667 3.9045 3.9558 4.0557 4.4347 3.9836 3.8697 4.0466 0.9792 0.9948 0.9922 0.9923 1.0099 1.0121 0.9943 1.0238 1.0055 1.0030 1.0016 1.0011 1.0010 1.0022 1.0000
dispcorr: -0.017367558 hartree
energy: -1579.996853045934
dipole: 37.84234 -38.50733 -0.66499 27.12769 -24.87374 2.25396 5.18327 -4.12181 1.06147
magnitude: 2.57861 au
magnitude: 6.55431 debye
