program: Orca
programVersion: 4.2.1
elementType: Cl F F F O N N N C C C C C C C C C C C C C C C H H H H H H H H H H H H H H H
charge: 0
multiplicity: 1
keywords: wb97x-d3
keywords: def2-TZVPP
keywords: def2/J RIJCOSX GRIDX6 NOFINALGRIDX
keywords: grid4 nofinalgrid
keywords: scfconv7
keywords: smallprint printgap noloewdin
keywords: NOSOSCF
formula: C15H15ClF3N3O
InChI: InChI=1S/C15H15ClF3N3O/c1-2-7-23-9-14(22-6-5-20-10-22)21-13-4-3-11(16)8-12(13)15(17,18)19/h3-6,8,10H,2,7,9H2,1H3
38 atoms
Cl -5.275424 1.294233 -0.532023
F  -1.029454 -2.890222 0.355318
F  -0.315049 -1.372886 1.703549
F  -2.308026 -2.1462 1.910125
O  2.269101 1.341111 0.812466
N  2.507895 -0.72203 -1.057557
N  0.243295 -0.711246 -1.04223
N  4.647822 -1.070164 -1.458803
C  1.301583 -0.063796 -0.811798
C  1.401862 1.344107 -0.283361
C  2.501493 2.635917 1.33283
C  -1.028477 -0.183209 -0.878712
C  3.534714 2.550475 2.43523
C  -1.891314 -0.715447 0.08757
C  -1.509137 0.806934 -1.732315
C  -3.194109 -0.253032 0.197384
C  2.639939 -2.065709 -1.346567
C  3.79639 3.915122 3.053916
C  3.762876 -0.179267 -1.142013
C  -1.387897 -1.781682 1.012481
C  -2.810084 1.266298 -1.630392
C  -3.645132 0.732398 -0.664288
C  3.96027 -2.254736 -1.580171
H  0.401516 1.695731 -0.005962
H  1.753567 2.007101 -1.088365
H  1.565347 3.062872 1.719105
H  2.854261 3.307268 0.537032
H  3.19093 1.854712 3.205076
H  4.464181 2.142794 2.029077
H  -0.861746 1.209882 -2.500412
H  -3.862949 -0.652609 0.946425
H  1.800398 -2.73815 -1.345399
H  2.895105 4.329202 3.509617
H  4.556142 3.852079 3.833128
H  4.149957 4.632459 2.310753
H  3.963318 0.86618 -0.979283
H  -3.162745 2.034832 -2.304559
H  4.459893 -3.177842 -1.828263
elementType: Cl F O N C H
totalener: -1579.97957125 hartree
nucrepener: 2115.11039372 hartree
electener: -3695.08996497 hartree
oneelecener: -6372.24036199 hartree
twoeener: 2677.15039703 hartree
cpcmener: -0.02533902 hartree
kineticenergy: 1574.92278579 hartree
xcener: -123.747340494998 hartree
chargesum: -0.0000000
charge: -0.087013 -0.175310 -0.179319 -0.178429 -0.356208 -0.036506 -0.309520 -0.376394 0.255315 -0.023615 0.028705 0.096558 -0.077746 -0.153887 -0.187393 -0.080820 -0.118409 -0.277203 0.071207 0.553616 -0.106453 0.082444 -0.118831 0.126425 0.141783 0.082500 0.076006 0.062835 0.062176 0.159377 0.133521 0.179746 0.081619 0.094932 0.080280 0.160376 0.147133 0.166501
qa: -0.0870 -0.1753 -0.1793 -0.1784 -0.3562 -0.0365 -0.3095 -0.3764 0.2553 -0.0236 0.0287 0.0966 -0.0777 -0.1539 -0.1874 -0.0808 -0.1184 -0.2772 0.0712 0.5536 -0.1065 0.0824 -0.1188 0.1264 0.1418 0.0825 0.0760 0.0628 0.0622 0.1594 0.1335 0.1797 0.0816 0.0949 0.0803 0.1604 0.1471 0.1665
va: 1.2163 1.1238 1.1158 1.1241 1.9521 3.3356 3.0125 3.1172 3.8940 4.0066 3.8938 3.9437 3.9010 3.8430 3.9922 3.9696 3.9031 3.9565 4.0569 4.4328 3.9838 3.8664 4.0438 0.9964 0.9801 0.9929 0.9924 1.0118 1.0099 0.9946 1.0240 1.0055 1.0016 1.0030 1.0012 1.0010 1.0022 0.9999
dispcorr: -0.017442491 hartree
energy: -1579.997013738832
dipole: 36.93060 -37.61536 -0.68476 27.00107 -24.58931 2.41177 4.44388 -4.82486 -0.38097
magnitude: 2.53587 au
magnitude: 6.44567 debye
