program: Gaussian 09
title: 000029992
version: EM64L-G09RevD.01
frameworkgroup: C1[X(C19H30N2O2)]
method: RPBEPBE
basis: SDD
operation: Freq
keyword: #p
keyword: freq=noraman
keyword: PBEPBE/SDD
title: #p freq=noraman PBEPBE/SDD
converged: YES YES NO NO
title: Mulliken charges:
elementType: O O N N C C C C C C C C C C C C C C C C C C C H H H H H H H H H H H H H H H H H H H H H H H H H H H H H H
charge: -0.332153 -0.266784 -0.125476 -0.479020 0.033138 -0.058521 -0.453750 -0.478612 -0.397880 -0.383213 -0.410897 -0.307756 -0.695258 -0.720486 0.253590 0.135391 0.338810 0.362789 -0.420708 -0.410653 -0.833260 -0.830330 -0.233213 0.161142 0.268140 0.232627 0.191383 0.205437 0.237664 0.200834 0.193000 0.198057 0.208635 0.251033 0.224287 0.204986 0.176169 0.221032 0.218738 0.217275 0.230585 0.217109 0.211321 0.326484 0.232164 0.232161 0.244193 0.234967 0.225314 0.283160 0.223898 0.217294 0.225165
chargesum: 0.00000
title: Mulliken charges with hydrogens summed into heavy atoms:
elementType: O O N N C C C C C C C C C C C C C C C C C C C
charge: -0.332153 -0.266784 -0.125476 -0.152536 0.194280 0.209619 -0.029740 -0.035512 -0.004047 0.023479 0.064422 0.073398 -0.038214 -0.061471 0.253590 0.135391 0.338810 0.362789 -0.188543 -0.178493 -0.128786 -0.105977 -0.008048
polarizability: 2.80290519e+02 -3.50754212e+00 2.30386917e+02 -5.31337194e-01 -1.58572078e+01 1.70660395e+02
1716.lowfreq: -4.8840 -1.6562 0.0003 0.0006 0.0007 9.5268 14.6863 21.8054 30.1445
frequency: 12.1724 21.4657 30.0446 55.0368 56.9400 73.4709 85.6160 93.1020 99.7226 120.8909 151.5536 160.6106 168.0247 177.4176 192.6185 203.1940 214.8676 226.3757 233.2878 268.2144 279.7649 286.1164 305.8688 309.2329 314.5377 321.6491 344.0846 383.7402 418.0806 463.1621 463.7136 493.0955 505.5078 512.6684 515.8868 535.7398 544.1966 568.2945 600.5745 612.0416 675.9112 695.1681 714.8422 742.6627 756.8377 772.4462 778.3949 793.2340 796.6591 814.3652 839.9512 862.2733 880.2147 898.9946 902.7893 905.7225 925.9821 939.3145 954.8130 974.7856 980.8118 989.2335 999.8268 1039.0992 1043.7975 1044.9424 1048.2525 1052.6790 1058.2255 1064.9353 1083.7042 1097.6493 1099.9793 1102.3202 1117.2421 1140.1122 1159.1639 1174.2149 1177.6614 1198.5992 1212.1481 1232.1334 1237.7363 1249.4402 1260.2945 1280.5836 1283.0611 1296.9209 1305.4730 1311.9995 1325.4749 1333.2192 1335.3860 1342.9070 1346.0245 1359.2968 1368.0617 1370.7758 1374.8296 1382.4641 1389.0764 1398.0462 1399.3888 1435.0379 1453.6889 1457.1818 1457.3560 1458.8002 1465.3472 1466.4591 1467.4182 1469.6122 1472.1965 1477.6011 1479.7426 1481.8973 1488.2404 1492.7052 1495.4000 1506.8417 1604.5484 1604.9359 1662.6201 2805.0761 2844.4285 2961.5099 2962.9717 2977.4112 2978.6060 2978.9773 2984.9151 2985.2561 3006.8512 3012.7592 3031.1884 3039.8978 3040.9648 3041.4709 3050.6974 3051.9635 3054.9183 3060.9360 3069.4454 3073.2236 3078.4984 3082.1460 3086.4511 3088.6855 3089.2116 3121.2087 3131.1432 3156.6307 3531.4039
redmass: 3.8726 4.1759 3.1505 4.1586 4.6451 2.8255 3.6596 3.5039 3.2099 2.8498 3.6720 1.0665 1.2592 1.1872 2.3667 2.4965 1.9436 2.2071 2.8220 2.5655 2.3219 2.6093 3.1282 2.5518 3.5915 2.8885 3.0872 2.3188 2.6680 2.2689 2.7232 2.7926 3.2760 4.3535 3.0735 4.0274 3.4122 2.7142 1.3534 3.3911 5.2590 7.9113 4.0053 2.5070 3.9046 1.1595 1.2216 2.3344 1.8018 1.5755 2.6126 2.5489 2.8082 1.3100 2.1479 1.6695 2.5140 2.6213 2.5659 1.3931 2.4180 2.3595 2.6513 1.7194 1.4982 1.6346 2.1952 1.5923 2.0009 2.0780 1.9874 1.6940 1.7349 1.6144 1.8288 1.8223 2.9707 2.2173 1.1981 2.0720 1.8610 2.9029 1.4254 1.2320 1.6840 2.4617 1.1801 1.1878 1.4178 1.2407 1.3930 1.3850 1.3933 1.3982 1.4099 1.4700 1.4940 3.8069 1.2440 1.2901 1.3335 1.2381 1.2673 1.9370 1.6239 1.1945 1.0865 1.0913 1.0666 1.0619 1.0584 1.1038 1.1183 1.0506 1.3135 1.0540 1.3412 1.1268 1.5740 1.0726 6.3016 6.1856 8.4176 1.0793 1.0723 1.0638 1.0415 1.0354 1.0364 1.0626 1.0383 1.0596 1.0632 1.0639 1.0930 1.0874 1.0928 1.0961 1.0897 1.1011 1.0944 1.0970 1.1023 1.0985 1.0982 1.1002 1.0998 1.0982 1.1003 1.0857 1.0919 1.0995 1.0755
irintensity: 0.1534 0.9067 0.5130 0.1106 0.9409 0.1237 2.5428 0.7394 1.3953 0.0479 3.1082 0.8785 0.4466 0.5060 1.6891 3.1065 3.9098 0.4329 6.5298 0.7944 2.1754 2.3444 4.6690 0.2914 1.6031 6.2114 2.9045 0.6615 8.6935 4.2530 0.7614 5.8860 1.2358 0.0286 1.0748 2.9547 9.9985 9.4195 67.1313 4.3784 0.6054 24.7700 18.6774 7.9518 3.5257 17.0184 54.5939 0.9920 9.2135 1.5518 7.1805 12.0887 11.6181 0.2607 3.1895 2.3128 25.8060 1.0287 8.1341 20.2274 210.5459 45.7673 31.2600 5.0734 11.8871 5.5449 7.7573 12.9124 7.7690 58.9317 10.0382 0.6417 35.2971 8.3815 11.7595 12.5619 463.1502 16.7805 8.0655 15.6788 11.8470 31.0015 0.9666 3.0785 7.3866 11.6034 14.4946 4.6777 1.7410 2.9281 4.9620 8.9081 1.1866 2.4880 8.9033 23.8354 19.5151 15.0518 27.1692 12.4314 13.0537 28.6931 3.6929 37.2434 48.8500 25.9177 3.3860 4.0402 1.2960 12.0812 19.2099 13.3021 37.8750 6.9771 120.2147 21.2185 60.5518 6.8565 248.5386 11.4876 8.7582 5.1395 185.7795 69.2359 122.6221 46.5831 31.2045 20.6851 20.7686 30.7650 51.4078 11.7937 25.5326 32.6492 55.7495 22.2820 12.0499 49.2764 23.8054 39.3853 4.2434 11.9896 45.9322 37.4637 118.1074 29.4888 21.4362 24.1462 41.8831 0.3683 25.6593 35.4362 23.7471
temp: 298.150 k
press: 1.00000 atm
elementType: 8 8 7 7 6 6 6 6 6 6 6 6 6 6 6 6 6 6 6 6 6 6 6 1 1 1 1 1 1 1 1 1 1 1 1 1 1 1 1 1 1 1 1 1 1 1 1 1 1 1 1 1 1
symmnumber: 1
zpe: 1204589.4 jmol-1
zpe.correction: 0.458804 hartree
zpe.thermalcorrener: 0.483444 hartree
zpe.thermalcorrenthalpy: 0.484388 hartree
zpe.thermalcorrgfe: 0.402986 hartree
zpe.sumelectzpe: -1000.195211 hartree
zpe.sumelectthermal: -1000.170571 hartree
zpe.sumelectthermalent: -1000.169627 hartree
zpe.sumelectthermalfe: -1000.251029 hartree
dipole: -1.1204 0.9877 -1.4729
dipole: 2.0977
quadrupole: -127.9970 -131.8840 -145.7204
quadrupole: 1.3312 -6.1078 -2.6121
quadrupole: 7.2034 3.3165 -10.5199 1.3312 -6.1078 -2.6121
hfenergy: -1000.6540147 hartree
pointgroup: C01 [X(C19H30N2O2)]
dipole: -0.3916315 -0.3634128 0.6290101 debye
polarizability: 279.4820325|6.5051212|227.6900097|-2.3775764|-21.346446|174.1657897 unknown
InChI: InChI=1S/C19H30N2O2/c1-5-21(6-2)16-12-7-8-13-17(16)23-19(22)20-18-14(3)10-9-11-15(18)4/h9-11,16-17,20H,5-8,12-13H2,1-4H3
charge 0 multiplicity 1
53 atoms
O  -0.649975 -0.700754 0.058444
O  0.604505 0.074087 -1.788617
N  -3.258324 0.651238 0.570996
N  1.500152 -0.101575 0.399005
C  -3.103816 -0.730038 0.017886
C  -1.829617 -0.931441 -0.835726
C  -3.127569 -1.801238 1.145396
C  -1.745912 -2.359434 -1.414375
C  -3.074421 -3.237173 0.569548
C  -1.824008 -3.442015 -0.316132
C  -2.735511 1.764701 -0.26539
C  -4.640156 0.894491 1.068408
C  -3.491227 2.067619 -1.590885
C  -4.778115 2.176637 1.911496
C  0.513052 -0.20843 -0.567166
C  2.859637 0.308788 0.180335
C  3.892276 -0.571376 0.624044
C  3.159035 1.573634 -0.40465
C  5.23928 -0.176844 0.453401
C  4.523809 1.918737 -0.574654
C  3.552545 -1.909309 1.257795
C  2.073057 2.547766 -0.812752
C  5.558038 1.057395 -0.153803
H  -3.947024 -0.966721 -0.68852
H  -1.761204 -0.203869 -1.662943
H  -2.259128 -1.61631 1.803781
H  -4.035713 -1.690957 1.764137
H  -2.585535 -2.487097 -2.127949
H  -0.812242 -2.448408 -1.999825
H  -3.082776 -3.971987 1.397422
H  -3.987068 -3.425881 -0.034386
H  -1.836168 -4.446978 -0.779763
H  -0.916037 -3.385226 0.315502
H  -1.672845 1.566578 -0.484543
H  -2.739256 2.675186 0.361266
H  -4.92444 0.039586 1.706021
H  -5.386241 0.918959 0.232054
H  -2.99247 2.897369 -2.125401
H  -4.538631 2.368326 -1.405789
H  -3.504031 1.194002 -2.268547
H  -4.018746 2.188398 2.71363
H  -4.661053 3.095346 1.309545
H  -5.780072 2.213099 2.377634
H  1.246715 -0.481504 1.314003
H  6.039049 -0.848261 0.787042
H  4.769274 2.886301 -1.027913
H  2.846691 -2.485583 0.631258
H  4.461826 -2.517405 1.397951
H  3.08257 -1.793531 2.255639
H  1.593971 2.22883 -1.756045
H  1.272362 2.598072 -0.05122
H  2.487936 3.560922 -0.949083
H  6.60535 1.348877 -0.289562
