program: Orca
programVersion: 4.2.1
elementType: Cl F F F O N N N C C C C C C C C C C C C C C C H H H H H H H H H H H H H H H
charge: 0
multiplicity: 1
keywords: wb97x-d3
keywords: def2-TZVPP
keywords: def2/J RIJCOSX GRIDX6 NOFINALGRIDX
keywords: grid4 nofinalgrid
keywords: scfconv7
keywords: smallprint printgap noloewdin
keywords: NOSOSCF
formula: C15H15ClF3N3O
InChI: InChI=1S/C15H15ClF3N3O/c1-2-7-23-9-14(22-6-5-20-10-22)21-13-4-3-11(16)8-12(13)15(17,18)19/h3-6,8,10H,2,7,9H2,1H3
38 atoms
Cl -5.291254 1.257454 -0.520279
F  -0.904225 -2.7729 0.504046
F  -0.201633 -1.127373 1.698979
F  -2.158751 -1.946691 2.037517
O  2.228992 1.248207 0.839631
N  2.494831 -0.718998 -1.120609
N  0.229222 -0.713395 -1.150835
N  4.641652 -1.034376 -1.51117
C  1.280755 -0.07986 -0.861161
C  1.362038 1.296829 -0.254223
C  2.4367 2.514653 1.435078
C  -1.044825 -0.196141 -0.955969
C  3.494669 2.390878 2.509997
C  -1.850224 -0.655918 0.092777
C  -1.579599 0.717707 -1.860444
C  -3.154913 -0.203269 0.226671
C  2.64218 -2.051641 -1.449582
C  3.730837 3.720988 3.208672
C  3.744744 -0.16195 -1.176382
C  -1.28224 -1.62752 1.081619
C  -2.880315 1.170425 -1.730913
C  -3.661312 0.704328 -0.687181
C  3.966708 -2.221143 -1.675236
H  0.355728 1.620002 0.037093
H  1.704158 2.005938 -1.023752
H  1.497331 2.890548 1.864293
H  2.755218 3.243452 0.675869
H  3.187087 1.638538 3.241067
H  4.426416 2.036576 2.061187
H  -0.972884 1.067897 -2.68521
H  -3.781014 -0.548357 1.037309
H  1.809598 -2.732252 -1.477203
H  4.51157 3.63281 3.964491
H  4.044103 4.494914 2.505159
H  2.829202 4.076715 3.710495
H  3.931837 0.880396 -0.980569
H  -3.275014 1.881365 -2.443953
H  4.477297 -3.131945 -1.945623
elementType: Cl F O N C H
totalener: -1579.97948424 hartree
nucrepener: 2124.63110298 hartree
electener: -3704.61058722 hartree
oneelecener: -6391.29066646 hartree
twoeener: 2686.68007924 hartree
cpcmener: -0.02509867 hartree
kineticenergy: 1574.91948481 hartree
xcener: -123.746200944597 hartree
chargesum: -0.0000000
charge: -0.087373 -0.174945 -0.178748 -0.177559 -0.353294 -0.032981 -0.298043 -0.376630 0.234434 -0.009154 0.027399 0.058034 -0.077437 -0.145190 -0.167319 -0.084333 -0.118114 -0.277535 0.071032 0.557421 -0.110605 0.084694 -0.119239 0.126173 0.146770 0.083639 0.075066 0.062188 0.062380 0.155640 0.133898 0.179234 0.094802 0.079919 0.082046 0.160059 0.147215 0.166457
qa: -0.0874 -0.1749 -0.1787 -0.1776 -0.3533 -0.0330 -0.2980 -0.3766 0.2344 -0.0092 0.0274 0.0580 -0.0774 -0.1452 -0.1673 -0.0843 -0.1181 -0.2775 0.0710 0.5574 -0.1106 0.0847 -0.1192 0.1262 0.1468 0.0836 0.0751 0.0622 0.0624 0.1556 0.1339 0.1792 0.0948 0.0799 0.0820 0.1601 0.1472 0.1665
va: 1.2158 1.1244 1.1162 1.1258 1.9511 3.3299 3.0198 3.1165 3.9131 3.9881 3.8961 3.9973 3.8998 3.8343 3.9926 3.9775 3.9042 3.9568 4.0572 4.4263 3.9874 3.8595 4.0434 0.9976 0.9828 0.9926 0.9921 1.0118 1.0097 0.9980 1.0243 1.0057 1.0029 1.0012 1.0016 1.0014 1.0021 0.9998
dispcorr: -0.017698739 hartree
energy: -1579.997182978212
dipole: 35.90013 -36.65198 -0.75185 25.19136 -22.89521 2.29615 4.60040 -4.94424 -0.34383
magnitude: 2.44046 au
magnitude: 6.20315 debye
