program: Orca
programVersion: 4.2.1
elementType: Cl F F F O N N N C C C C C C C C C C C C C C C H H H H H H H H H H H H H H H
charge: 0
multiplicity: 1
keywords: wb97x-d3
keywords: def2-TZVPP
keywords: def2/J RIJCOSX GRIDX6 NOFINALGRIDX
keywords: grid4 nofinalgrid
keywords: scfconv7
keywords: smallprint printgap noloewdin
keywords: NOSOSCF
formula: C15H15ClF3N3O
InChI: InChI=1S/C15H15ClF3N3O/c1-2-7-23-9-14(22-6-5-20-10-22)21-13-4-3-11(16)8-12(13)15(17,18)19/h3-6,8,10H,2,7,9H2,1H3
38 atoms
Cl -5.079709 1.412187 -0.48912
F  -0.797772 -2.724142 0.676518
F  -0.056958 -1.024033 1.765853
F  -2.026405 -1.783409 2.164559
O  2.292183 0.908748 0.98528
N  2.58935 -0.951993 -1.092284
N  0.323641 -0.851793 -1.173981
N  3.922698 -2.607059 -1.676814
C  1.394921 -0.276768 -0.83666
C  1.521592 1.069831 -0.172738
C  2.086663 1.904542 1.968985
C  -0.92863 -0.284418 -0.969915
C  2.612962 3.278072 1.590384
C  -1.709574 -0.620379 0.142419
C  -1.462735 0.571491 -1.929764
C  -2.98614 -0.094461 0.288148
C  3.875535 -0.448877 -1.066707
C  2.451877 4.255855 2.745306
C  2.691073 -2.263615 -1.471421
C  -1.151675 -1.539552 1.185616
C  -2.734342 1.095991 -1.78856
C  -3.488502 0.759991 -0.676827
C  4.672358 -1.481077 -1.4339
H  0.519097 1.447623 0.055545
H  1.966017 1.778118 -0.885218
H  2.604712 1.54265 2.859901
H  1.019091 1.971201 2.221227
H  3.667476 3.198977 1.312342
H  2.082007 3.663852 0.715238
H  -0.874145 0.821705 -2.802439
H  -3.592068 -0.340857 1.148596
H  4.110702 0.56723 -0.805134
H  3.004457 3.927271 3.627302
H  2.821041 5.245885 2.477946
H  1.405041 4.365362 3.034661
H  1.825159 -2.898497 -1.564027
H  -3.127809 1.762313 -2.544003
H  5.74595 -1.478877 -1.536945
elementType: Cl F O N C H
totalener: -1579.97673363 hartree
nucrepener: 2147.14349375 hartree
electener: -3727.12022737 hartree
oneelecener: -6436.19049552 hartree
twoeener: 2709.07026814 hartree
cpcmener: -0.02506154 hartree
kineticenergy: 1574.92382971 hartree
xcener: -123.747844853857 hartree
chargesum: -0.0000000
charge: -0.087384 -0.174796 -0.174646 -0.177232 -0.357343 -0.022568 -0.297832 -0.374896 0.222795 -0.003988 0.019656 0.063831 -0.079596 -0.158031 -0.161245 -0.086514 -0.123940 -0.278495 0.069689 0.562484 -0.109735 0.084231 -0.122461 0.125880 0.146671 0.097991 0.071561 0.062904 0.064879 0.150993 0.132990 0.176440 0.083976 0.093839 0.082775 0.163554 0.147643 0.165919
qa: -0.0874 -0.1748 -0.1746 -0.1772 -0.3573 -0.0226 -0.2978 -0.3749 0.2228 -0.0040 0.0197 0.0638 -0.0796 -0.1580 -0.1612 -0.0865 -0.1239 -0.2785 0.0697 0.5625 -0.1097 0.0842 -0.1225 0.1259 0.1467 0.0980 0.0716 0.0629 0.0649 0.1510 0.1330 0.1764 0.0840 0.0938 0.0828 0.1636 0.1476 0.1659
va: 1.2157 1.1246 1.1187 1.1267 1.9396 3.3253 3.0141 3.1194 3.9784 3.9516 3.9205 3.9908 3.8462 3.8377 3.9857 3.9830 3.9302 3.9535 4.0210 4.4096 3.9845 3.8554 4.0357 0.9913 0.9809 0.9973 1.0000 1.0126 1.0098 1.0016 1.0247 0.9978 1.0013 1.0022 1.0016 1.0130 1.0017 1.0001
dispcorr: -0.018452575 hartree
energy: -1579.995186201975
dipole: 31.21121 -31.52782 -0.31660 27.36489 -24.17213 3.19276 2.98514 -3.08159 -0.09645
magnitude: 3.20987 au
magnitude: 8.15885 debye
