program: Orca
programVersion: 4.2.1
elementType: Cl F F F O N N N C C C C C C C C C C C C C C C H H H H H H H H H H H H H H H
charge: 0
multiplicity: 1
keywords: wb97x-d3
keywords: def2-TZVPP
keywords: def2/J RIJCOSX GRIDX6 NOFINALGRIDX
keywords: grid4 nofinalgrid
keywords: scfconv7
keywords: smallprint printgap noloewdin
keywords: NOSOSCF
formula: C15H15ClF3N3O
InChI: InChI=1S/C15H15ClF3N3O/c1-2-7-23-9-14(22-6-5-20-10-22)21-13-4-3-11(16)8-12(13)15(17,18)19/h3-6,8,10H,2,7,9H2,1H3
38 atoms
Cl -5.337718 0.826364 0.864832
F  -0.610984 -1.892298 -1.783572
F  -1.850764 -0.412195 -2.723123
F  0.01343 0.165248 -1.826165
O  2.192216 1.485504 -0.087642
N  2.488364 -1.11207 0.907325
N  0.22274 -1.139034 0.845932
N  4.637694 -1.524033 1.173741
C  1.268525 -0.436165 0.895634
C  1.34214 1.068248 0.936806
C  2.34883 2.888179 -0.145621
C  -1.058676 -0.603828 0.829189
C  3.345153 3.231542 -1.231887
C  -1.747719 -0.389997 -0.371056
C  -1.721191 -0.369151 2.032008
C  -3.063074 0.054426 -0.35618
C  2.662008 -2.461082 0.670082
C  2.932321 2.758147 -2.617712
C  3.725456 -0.60573 1.20731
C  -1.052738 -0.634252 -1.67564
C  -3.031035 0.073078 2.050203
C  -3.695235 0.281463 0.852942
C  3.987243 -2.686568 0.833046
H  1.701029 1.38283 1.928551
H  0.332375 1.480902 0.830707
H  2.700933 3.27158 0.821807
H  1.382474 3.370307 -0.350174
H  3.459462 4.3185 -1.230467
H  4.324096 2.820843 -0.969317
H  -1.20326 -0.548841 2.964803
H  -3.599507 0.226525 -1.278564
H  1.844549 -3.107679 0.40429
H  2.855177 1.672255 -2.670644
H  1.965197 3.173386 -2.908656
H  3.661194 3.070925 -3.366563
H  3.89413 0.429706 1.451374
H  -3.526547 0.249257 2.995257
H  4.516151 -3.620032 0.722303
elementType: Cl F O N C H
totalener: -1579.97847925 hartree
nucrepener: 2158.42834844 hartree
electener: -3738.40682769 hartree
oneelecener: -6458.98272987 hartree
twoeener: 2720.57590217 hartree
cpcmener: -0.02384560 hartree
kineticenergy: 1574.92615626 hartree
xcener: -123.747052223018 hartree
chargesum: 0.0000000
charge: -0.088467 -0.176177 -0.177709 -0.171177 -0.341668 -0.032401 -0.293818 -0.376159 0.226027 -0.001296 0.014526 0.057758 -0.106857 -0.154153 -0.166438 -0.085795 -0.119227 -0.252053 0.070637 0.564131 -0.111536 0.085280 -0.117788 0.144769 0.122667 0.089130 0.086014 0.065992 0.061654 0.151603 0.133587 0.179712 0.080468 0.073576 0.092445 0.159545 0.147250 0.165944
qa: -0.0885 -0.1762 -0.1777 -0.1712 -0.3417 -0.0324 -0.2938 -0.3762 0.2260 -0.0013 0.0145 0.0578 -0.1069 -0.1542 -0.1664 -0.0858 -0.1192 -0.2521 0.0706 0.5641 -0.1115 0.0853 -0.1178 0.1448 0.1227 0.0891 0.0860 0.0660 0.0617 0.1516 0.1336 0.1797 0.0805 0.0736 0.0924 0.1595 0.1473 0.1659
va: 1.2147 1.1226 1.1257 1.1255 1.9395 3.3252 3.0186 3.1174 3.9331 3.9608 3.8925 3.9983 3.9376 3.8399 3.9955 3.9814 3.9044 3.9181 4.0577 4.4099 3.9862 3.8505 4.0431 0.9864 0.9981 0.9966 0.9927 1.0120 1.0117 1.0022 1.0247 1.0063 1.0129 1.0040 1.0046 1.0020 1.0020 1.0000
dispcorr: -0.018573038 hartree
energy: -1579.997052288883
dipole: 32.26036 -33.11479 -0.85443 17.82671 -16.11829 1.70841 4.21549 -2.93477 1.28073
magnitude: 2.29978 au
magnitude: 5.84557 debye
