program: Orca
programVersion: 4.2.1
elementType: Cl F F F O N N N C C C C C C C C C C C C C C C H H H H H H H H H H H H H H H
charge: 0
multiplicity: 1
keywords: wb97x-d3
keywords: def2-TZVPP
keywords: def2/J RIJCOSX GRIDX6 NOFINALGRIDX
keywords: grid4 nofinalgrid
keywords: scfconv7
keywords: smallprint printgap noloewdin
keywords: NOSOSCF
formula: C15H15ClF3N3O
InChI: InChI=1S/C15H15ClF3N3O/c1-2-7-23-9-14(22-6-5-20-10-22)21-13-4-3-11(16)8-12(13)15(17,18)19/h3-6,8,10H,2,7,9H2,1H3
38 atoms
Cl -4.87762 1.660284 -0.04489
F  -1.226051 -3.11814 -0.653148
F  -0.642922 -2.437613 1.302531
F  -2.696717 -2.919063 0.89807
O  1.757063 1.754823 0.602917
N  2.671136 -1.030021 -0.442967
N  0.445012 -0.76495 -0.807399
N  4.848172 -1.359586 -0.54476
C  1.447025 -0.458698 -0.103185
C  1.434494 0.478684 1.079017
C  1.562464 2.763314 1.57641
C  -0.798842 -0.185235 -0.580352
C  1.759589 4.121148 0.940204
C  -1.851701 -0.933062 -0.041603
C  -1.037088 1.133682 -0.960233
C  -3.10541 -0.361706 0.126413
C  2.872358 -2.026532 -1.375485
C  3.154196 4.344291 0.375902
C  3.90852 -0.668255 0.017893
C  -1.607358 -2.351339 0.373618
C  -2.28755 1.702867 -0.804033
C  -3.31331 0.951876 -0.255485
C  4.213333 -2.216401 -1.412212
H  2.127079 0.133592 1.856465
H  0.433789 0.454929 1.527492
H  2.263253 2.625863 2.412032
H  0.548559 2.691355 1.992913
H  1.007725 4.265628 0.158997
H  1.548232 4.868311 1.70947
H  -0.236737 1.714339 -1.397581
H  -3.920164 -0.928259 0.5546
H  2.058609 -2.500915 -1.895002
H  3.253455 5.354537 -0.023197
H  3.918782 4.220779 1.145742
H  3.383073 3.650299 -0.433029
H  4.057657 0.113003 0.745737
H  -2.45331 2.727978 -1.10638
H  4.762841 -2.924494 -2.012222
elementType: Cl F O N C H
totalener: -1579.97852354 hartree
nucrepener: 2139.62349373 hartree
electener: -3719.60201727 hartree
oneelecener: -6420.92281226 hartree
twoeener: 2701.32079499 hartree
cpcmener: -0.02198246 hartree
kineticenergy: 1574.93147486 hartree
xcener: -123.746594407623 hartree
chargesum: -0.0000000
charge: -0.087645 -0.174712 -0.181320 -0.177563 -0.335912 -0.033417 -0.309129 -0.374532 0.263113 -0.035144 0.017965 0.110225 -0.110518 -0.155654 -0.181084 -0.082022 -0.118375 -0.253135 0.064737 0.555077 -0.123675 0.088539 -0.113649 0.126153 0.121808 0.092672 0.088804 0.061934 0.067977 0.148334 0.133748 0.179804 0.091953 0.075762 0.080635 0.164187 0.147366 0.166693
qa: -0.0876 -0.1747 -0.1813 -0.1776 -0.3359 -0.0334 -0.3091 -0.3745 0.2631 -0.0351 0.0180 0.1102 -0.1105 -0.1557 -0.1811 -0.0820 -0.1184 -0.2531 0.0647 0.5551 -0.1237 0.0885 -0.1136 0.1262 0.1218 0.0927 0.0888 0.0619 0.0680 0.1483 0.1337 0.1798 0.0920 0.0758 0.0806 0.1642 0.1474 0.1667
va: 1.2154 1.1259 1.1130 1.1258 1.9333 3.3542 3.0241 3.1160 3.8729 3.9939 3.8792 3.9360 3.9388 3.8419 3.9825 3.9792 3.9029 3.9174 4.0497 4.4307 4.0019 3.8625 4.0397 0.9915 0.9948 0.9946 0.9981 1.0102 1.0121 1.0111 1.0240 1.0061 1.0049 1.0032 1.0109 0.9958 1.0028 0.9996
dispcorr: -0.018721673 hartree
energy: -1579.997245207791
dipole: 32.79313 -33.39630 -0.60317 30.92405 -29.18322 1.74084 3.39182 -2.40278 0.98904
magnitude: 2.09106 au
magnitude: 5.31505 debye
