program: Orca
programVersion: 4.2.1
elementType: Cl F F F O N N N C C C C C C C C C C C C C C C H H H H H H H H H H H H H H H
charge: 0
multiplicity: 1
keywords: wb97x-d3
keywords: def2-TZVPP
keywords: def2/J RIJCOSX GRIDX6 NOFINALGRIDX
keywords: grid4 nofinalgrid
keywords: scfconv7
keywords: smallprint printgap noloewdin
keywords: NOSOSCF
formula: C15H15ClF3N3O
InChI: InChI=1S/C15H15ClF3N3O/c1-2-7-23-9-14(22-6-5-20-10-22)21-13-4-3-11(16)8-12(13)15(17,18)19/h3-6,8,10H,2,7,9H2,1H3
38 atoms
Cl -5.002565 1.40959 0.662976
F  -0.823102 -2.477011 -1.303604
F  -1.937398 -1.168036 -2.589283
F  0.050016 -0.630485 -1.975987
O  2.542466 1.331988 -0.322251
N  2.624711 -1.142667 0.956057
N  0.363072 -1.025232 0.884793
N  4.731208 -1.675916 1.32595
C  1.453723 -0.391459 0.855144
C  1.620795 1.098891 0.702867
C  2.883674 2.697743 -0.489458
C  -0.873992 -0.399552 0.808351
C  1.780504 3.537223 -1.111303
C  -1.648948 -0.488295 -0.35417
C  -1.40623 0.247546 1.92091
C  -2.91661 0.074536 -0.3982
C  2.707722 -2.515636 0.841082
C  1.289593 2.993566 -2.443322
C  3.885574 -0.697826 1.25089
C  -1.09345 -1.191644 -1.554471
C  -2.671815 0.804123 1.883205
C  -3.418687 0.71547 0.720839
C  4.009341 -2.81626 1.063165
H  1.952562 1.525521 1.661453
H  0.640426 1.53794 0.493038
H  3.759345 2.699276 -1.141835
H  3.192207 3.131141 0.471034
H  0.942015 3.651957 -0.418374
H  2.188925 4.542337 -1.246937
H  -0.825285 0.302582 2.832254
H  -3.516812 0.0186 -1.29537
H  1.85389 -3.124907 0.602861
H  0.551494 3.660298 -2.890296
H  2.109939 2.888249 -3.156109
H  0.820031 2.015532 -2.337759
H  4.119166 0.340469 1.416746
H  -3.065788 1.303117 2.758115
H  4.473447 -3.789725 1.046599
elementType: Cl F O N C H
totalener: -1579.97723754 hartree
nucrepener: 2166.26720731 hartree
electener: -3746.24444486 hartree
oneelecener: -6474.55582282 hartree
twoeener: 2728.31137796 hartree
cpcmener: -0.02513621 hartree
kineticenergy: 1574.92864600 hartree
xcener: -123.749213064862 hartree
chargesum: 0.0000000
charge: -0.087684 -0.174030 -0.178499 -0.178871 -0.363545 -0.031610 -0.298314 -0.375769 0.235946 -0.018167 0.021735 0.072476 -0.126714 -0.156674 -0.165359 -0.084021 -0.118309 -0.256645 0.068674 0.561149 -0.112064 0.087636 -0.119465 0.148755 0.122290 0.102578 0.089937 0.067100 0.077272 0.155818 0.133535 0.178808 0.093569 0.081876 0.071782 0.160847 0.147544 0.166410
qa: -0.0877 -0.1740 -0.1785 -0.1789 -0.3635 -0.0316 -0.2983 -0.3758 0.2359 -0.0182 0.0217 0.0725 -0.1267 -0.1567 -0.1654 -0.0840 -0.1183 -0.2566 0.0687 0.5611 -0.1121 0.0876 -0.1195 0.1488 0.1223 0.1026 0.0899 0.0671 0.0773 0.1558 0.1335 0.1788 0.0936 0.0819 0.0718 0.1608 0.1475 0.1664
va: 1.2154 1.1246 1.1247 1.1110 1.9190 3.3338 3.0164 3.1187 3.9054 4.0030 3.8922 3.9720 3.8720 3.8399 3.9823 3.9818 3.9066 3.9285 4.0623 4.4015 3.9915 3.8579 4.0459 0.9823 0.9853 0.9935 1.0034 1.0052 1.0143 0.9973 1.0242 1.0059 1.0060 1.0023 1.0124 1.0003 1.0022 0.9999
dispcorr: -0.019148761 hartree
energy: -1579.996386303309
dipole: 27.12502 -27.88196 -0.75694 21.45736 -19.25569 2.20167 3.59262 -2.56267 1.02995
magnitude: 2.54580 au
magnitude: 6.47092 debye
