program: Orca
programVersion: 4.2.1
elementType: Cl F F F O N N N C C C C C C C C C C C C C C C H H H H H H H H H H H H H H H
charge: 0
multiplicity: 1
keywords: wb97x-d3
keywords: def2-TZVPP
keywords: def2/J RIJCOSX GRIDX6 NOFINALGRIDX
keywords: grid4 nofinalgrid
keywords: scfconv7
keywords: smallprint printgap noloewdin
keywords: NOSOSCF
formula: C15H15ClF3N3O
InChI: InChI=1S/C15H15ClF3N3O/c1-2-7-23-9-14(22-6-5-20-10-22)21-13-4-3-11(16)8-12(13)15(17,18)19/h3-6,8,10H,2,7,9H2,1H3
38 atoms
Cl -4.828931 1.782879 0.419507
F  -1.308299 -3.096592 0.495446
F  -2.88932 -2.799558 -0.924607
F  -0.858191 -2.389304 -1.486498
O  2.210745 1.830801 -0.435958
N  2.692598 -1.059402 0.150774
N  0.465689 -0.804637 0.495272
N  4.840737 -1.556171 0.137867
C  1.498364 -0.385293 -0.098016
C  1.573096 0.760719 -1.074415
C  2.354227 2.956315 -1.282112
C  -0.761706 -0.165774 0.419242
C  2.988987 4.091417 -0.510375
C  -1.89098 -0.872952 -0.012721
C  -0.923188 1.145872 0.863414
C  -3.138882 -0.268283 -0.020884
C  2.839822 -2.183181 0.938677
C  2.164436 4.561527 0.678446
C  3.943837 -0.731138 -0.299883
C  -1.737056 -2.288657 -0.480167
C  -2.168029 1.748254 0.868062
C  -3.268593 1.037408 0.421465
C  4.163149 -2.469961 0.910255
H  0.560103 1.023032 -1.399331
H  2.110945 0.436673 -1.976053
H  1.372595 3.266286 -1.6673
H  2.973068 2.697467 -2.151729
H  3.991366 3.798969 -0.185199
H  3.125746 4.916085 -1.214484
H  -0.063808 1.695883 1.224338
H  -4.012573 -0.803416 -0.365177
H  2.004579 -2.661536 1.418745
H  2.079091 3.792635 1.446569
H  2.618711 5.436541 1.145045
H  1.153413 4.841361 0.3743
H  4.136487 0.12035 -0.931527
H  -2.272132 2.765581 1.220017
H  4.672191 -3.285278 1.399703
elementType: Cl F O N C H
totalener: -1579.97975672 hartree
nucrepener: 2125.18131753 hartree
electener: -3705.16107425 hartree
oneelecener: -6392.09221364 hartree
twoeener: 2686.93113939 hartree
cpcmener: -0.02239715 hartree
kineticenergy: 1574.92873182 hartree
xcener: -123.747706338303 hartree
chargesum: -0.0000000
charge: -0.086491 -0.175189 -0.179163 -0.179657 -0.348088 -0.042459 -0.322204 -0.373699 0.282645 -0.066057 0.022108 0.130049 -0.099900 -0.159380 -0.194135 -0.076943 -0.118943 -0.263162 0.064890 0.548350 -0.116173 0.084023 -0.113688 0.136278 0.139323 0.085010 0.093179 0.063161 0.065849 0.159978 0.133218 0.180776 0.080940 0.097230 0.075574 0.161285 0.145955 0.165511
qa: -0.0865 -0.1752 -0.1792 -0.1797 -0.3481 -0.0425 -0.3222 -0.3737 0.2826 -0.0661 0.0221 0.1300 -0.0999 -0.1594 -0.1941 -0.0769 -0.1189 -0.2632 0.0649 0.5484 -0.1162 0.0840 -0.1137 0.1363 0.1393 0.0850 0.0932 0.0632 0.0658 0.1600 0.1332 0.1808 0.0809 0.0972 0.0756 0.1613 0.1460 0.1655
va: 1.2169 1.1242 1.1229 1.1161 1.9209 3.3561 3.0043 3.1176 3.8547 3.9903 3.8760 3.9104 3.9268 3.8487 3.9758 3.9649 3.8990 3.9187 4.0570 4.4405 4.0114 3.8704 4.0391 0.9896 0.9903 0.9932 0.9978 1.0128 1.0117 1.0021 1.0239 1.0060 1.0087 1.0053 1.0030 1.0000 1.0041 1.0001
dispcorr: -0.018272423 hartree
energy: -1579.998029138624
dipole: 34.28062 -34.67862 -0.39800 31.63481 -29.55466 2.08014 -0.25362 -0.57861 -0.83223
magnitude: 2.27552 au
magnitude: 5.78392 debye
