program: Orca
programVersion: 4.2.1
elementType: Cl F F F O N N N C C C C C C C C C C C C C C C H H H H H H H H H H H H H H H
charge: 0
multiplicity: 1
keywords: wb97x-d3
keywords: def2-TZVPP
keywords: def2/J RIJCOSX GRIDX6 NOFINALGRIDX
keywords: grid4 nofinalgrid
keywords: scfconv7
keywords: smallprint printgap noloewdin
keywords: NOSOSCF
formula: C15H15ClF3N3O
InChI: InChI=1S/C15H15ClF3N3O/c1-2-7-23-9-14(22-6-5-20-10-22)21-13-4-3-11(16)8-12(13)15(17,18)19/h3-6,8,10H,2,7,9H2,1H3
38 atoms
Cl -5.101366 1.454193 0.543571
F  -0.318597 -1.248545 -1.945015
F  -1.032741 -2.857354 -0.708984
F  -2.334599 -1.957934 -2.159893
O  2.267162 1.78289 0.3883
N  2.548799 -1.047607 0.7406
N  0.289784 -0.905062 0.923291
N  3.901735 -2.603433 1.52306
C  1.350532 -0.380959 0.485492
C  1.454797 0.887623 -0.319617
C  2.376687 3.061688 -0.212011
C  -0.957484 -0.309401 0.782474
C  3.123794 3.073858 -1.535661
C  -1.836799 -0.695178 -0.236187
C  -1.386572 0.625815 1.720873
C  -3.110314 -0.147649 -0.309532
C  3.811378 -0.749381 0.264019
C  3.297816 4.495733 -2.048674
C  2.677159 -2.184764 1.49466
C  -1.386327 -1.691974 -1.259173
C  -2.655296 1.171553 1.652175
C  -3.510329 0.779863 0.635644
C  4.620058 -1.718094 0.754953
H  0.4528 1.299252 -0.484529
H  1.86016 0.63685 -1.308123
H  2.908527 3.676515 0.517362
H  1.379087 3.504237 -0.341561
H  4.103085 2.604386 -1.405537
H  2.58746 2.489397 -2.288125
H  -0.719536 0.918262 2.520928
H  -3.792776 -0.435007 -1.096904
H  4.027812 0.097417 -0.361567
H  2.335141 4.988213 -2.198667
H  3.876866 5.105554 -1.352918
H  3.820214 4.503903 -3.0054
H  1.833967 -2.639858 1.987585
H  -2.969921 1.89624 2.390885
H  5.682032 -1.82744 0.601915
elementType: Cl F O N C H
totalener: -1579.97691762 hartree
nucrepener: 2127.80049145 hartree
electener: -3707.77740906 hartree
oneelecener: -6397.25207114 hartree
twoeener: 2689.47466208 hartree
cpcmener: -0.02313782 hartree
kineticenergy: 1574.92194575 hartree
xcener: -123.748194854875 hartree
chargesum: 0.0000000
charge: -0.087617 -0.181792 -0.173771 -0.176143 -0.366591 -0.025385 -0.305015 -0.371159 0.253064 -0.024500 0.021075 0.049146 -0.093065 -0.140642 -0.168623 -0.085649 -0.124565 -0.281509 0.068737 0.561446 -0.104872 0.082359 -0.124172 0.132392 0.145384 0.099221 0.078081 0.065152 0.070292 0.151619 0.133737 0.180836 0.084607 0.084438 0.094739 0.164634 0.147284 0.166827
qa: -0.0876 -0.1818 -0.1738 -0.1761 -0.3666 -0.0254 -0.3050 -0.3712 0.2531 -0.0245 0.0211 0.0491 -0.0931 -0.1406 -0.1686 -0.0856 -0.1246 -0.2815 0.0687 0.5614 -0.1049 0.0824 -0.1242 0.1324 0.1454 0.0992 0.0781 0.0652 0.0703 0.1516 0.1337 0.1808 0.0846 0.0844 0.0947 0.1646 0.1473 0.1668
va: 1.2157 1.1116 1.1271 1.1285 1.9313 3.3410 2.9996 3.1240 3.8773 3.9508 3.9041 4.0168 3.8317 3.8268 3.9839 3.9817 3.9223 3.9652 4.0197 4.4211 3.9849 3.8592 4.0423 0.9995 0.9802 0.9982 0.9980 1.0112 1.0096 1.0024 1.0244 0.9923 1.0011 1.0012 1.0010 1.0143 1.0018 1.0006
dispcorr: -0.018187192 hartree
energy: -1579.995104808122
dipole: 35.96934 -36.04382 -0.07447 28.74726 -25.99549 2.75177 -1.57352 0.73212 -0.84140
magnitude: 2.87849 au
magnitude: 7.31655 debye
