program: Orca
programVersion: 4.2.1
elementType: Cl F F F O N N N C C C C C C C C C C C C C C C H H H H H H H H H H H H H H H
charge: 0
multiplicity: 1
keywords: wb97x-d3
keywords: def2-TZVPP
keywords: def2/J RIJCOSX GRIDX6 NOFINALGRIDX
keywords: grid4 nofinalgrid
keywords: scfconv7
keywords: smallprint printgap noloewdin
keywords: NOSOSCF
formula: C15H15ClF3N3O
InChI: InChI=1S/C15H15ClF3N3O/c1-2-7-23-9-14(22-6-5-20-10-22)21-13-4-3-11(16)8-12(13)15(17,18)19/h3-6,8,10H,2,7,9H2,1H3
38 atoms
Cl -5.155179 1.464745 -0.263891
F  -0.322407 -1.630468 1.622944
F  -2.326142 -2.403283 1.644102
F  -0.997969 -2.917655 0.03771
O  2.223694 1.929891 0.110893
N  2.563398 -0.756377 -0.891174
N  0.30928 -0.600965 -1.058048
N  4.704968 -1.28005 -0.942869
C  1.357221 -0.17765 -0.49821
C  1.430977 0.874058 0.580186
C  2.103789 3.11859 0.874831
C  -0.952731 -0.08027 -0.802701
C  2.609413 3.00945 2.303062
C  -1.838451 -0.7186 0.073458
C  -1.391833 1.042216 -1.500393
C  -3.12991 -0.238205 0.240691
C  2.708249 -1.725456 -1.864681
C  4.054956 2.552331 2.41406
C  3.812548 -0.534644 -0.37418
C  -1.376673 -1.9189 0.840891
C  -2.678117 1.522961 -1.336924
C  -3.540976 0.876558 -0.467855
C  4.028052 -2.027076 -1.877657
H  1.833916 0.41676 1.493809
H  0.415593 1.209113 0.818449
H  1.058585 3.455841 0.876986
H  2.684398 3.867439 0.332231
H  2.503026 4.003643 2.745625
H  1.961811 2.35553 2.894554
H  -0.719206 1.534261 -2.190261
H  -3.817881 -0.72344 0.918585
H  1.876359 -2.096052 -2.436517
H  4.724027 3.194267 1.837847
H  4.391419 2.573246 3.451142
H  4.195171 1.530446 2.058996
H  4.006369 0.180057 0.407608
H  -3.000308 2.395536 -1.888772
H  4.534265 -2.743363 -2.505387
elementType: Cl F O N C H
totalener: -1579.97694750 hartree
nucrepener: 2142.37304857 hartree
electener: -3722.34999607 hartree
oneelecener: -6426.43307370 hartree
twoeener: 2704.08307763 hartree
cpcmener: -0.02250521 hartree
kineticenergy: 1574.92494761 hartree
xcener: -123.749056535104 hartree
chargesum: -0.0000000
charge: -0.087702 -0.181958 -0.176309 -0.173886 -0.364736 -0.036740 -0.297917 -0.373549 0.249777 -0.034688 0.014105 0.058655 -0.102919 -0.139761 -0.178485 -0.084534 -0.118835 -0.279901 0.068280 0.560833 -0.105676 0.083656 -0.113680 0.142930 0.130595 0.086599 0.100390 0.078964 0.069027 0.152283 0.133782 0.180814 0.084800 0.100848 0.082494 0.159773 0.147652 0.165019
qa: -0.0877 -0.1820 -0.1763 -0.1739 -0.3647 -0.0367 -0.2979 -0.3735 0.2498 -0.0347 0.0141 0.0587 -0.1029 -0.1398 -0.1785 -0.0845 -0.1188 -0.2799 0.0683 0.5608 -0.1057 0.0837 -0.1137 0.1429 0.1306 0.0866 0.1004 0.0790 0.0690 0.1523 0.1338 0.1808 0.0848 0.1008 0.0825 0.1598 0.1477 0.1650
va: 1.2155 1.1119 1.1282 1.1265 1.9156 3.3520 3.0024 3.1207 3.8907 3.9812 3.9076 4.0001 3.8331 3.8325 3.9867 3.9807 3.8942 3.9428 4.0366 4.4213 3.9848 3.8578 4.0375 0.9794 0.9962 1.0013 0.9941 1.0120 1.0064 1.0025 1.0242 1.0076 1.0012 1.0045 0.9972 1.0121 1.0017 1.0005
dispcorr: -0.018908993 hartree
energy: -1579.995856498139
dipole: 35.28685 -36.12443 -0.83758 24.27393 -22.31386 1.96007 5.35104 -4.75441 0.59663
magnitude: 2.21346 au
magnitude: 5.62616 debye
