program: Gaussian 09
title: 000029863
version: EM64L-G09RevD.01
frameworkgroup: C1[X(C10H13ClN2O2)]
method: RPBEPBE
basis: SDD
operation: Freq
keyword: #p
keyword: freq=noraman
keyword: PBEPBE/SDD
title: #p freq=noraman PBEPBE/SDD
converged: YES YES NO NO
title: Mulliken charges:
elementType: Cl O O N N C C C C C C C C C C H H H H H H H H H H H H H
charge: -0.049180 -0.282762 -0.314816 -0.510886 -0.163983 0.524532 -0.487708 -0.336337 0.304521 0.415478 -0.251466 -0.312920 -0.630525 -0.670153 -0.516462 0.326184 0.241182 0.315967 0.250878 0.225781 0.225316 0.290093 0.250475 0.238151 0.235547 0.235734 0.217819 0.229540
chargesum: 0.00000
title: Mulliken charges with hydrogens summed into heavy atoms:
elementType: Cl O O N N C C C C C C C C C C
charge: -0.049180 -0.282762 -0.314816 -0.184702 -0.163983 0.524532 -0.246526 -0.020370 0.304521 0.415478 -0.251466 -0.062043 0.110665 0.054020 0.166632
polarizability: 2.29921602e+02 -1.65008693e+00 1.41635872e+02 6.33406577e-01 2.13488094e+00 7.22494974e+01
1716.lowfreq: -0.0011 0.0014 0.0021 4.7893 6.1313 8.9925 29.0376 44.3464 71.6707
frequency: 28.8866 44.3289 71.6580 81.5580 103.6034 107.3682 118.3184 149.7056 161.4465 181.6833 196.7076 213.5565 234.6884 249.8302 275.5061 359.2680 389.7664 418.1874 426.3231 447.8361 487.0070 542.0215 558.9501 604.0208 612.4449 677.2535 702.4524 713.1379 741.9681 841.1399 856.1795 858.5881 873.7223 950.6184 982.5312 1010.2986 1024.0666 1059.7485 1094.5920 1109.0808 1131.6874 1136.4021 1152.1444 1161.1292 1205.2494 1242.4732 1256.5244 1284.9349 1330.1380 1358.3533 1400.2518 1420.5728 1431.4415 1448.3354 1459.3903 1472.0680 1479.6258 1481.5516 1483.7262 1494.4366 1495.9852 1507.4563 1574.8909 1616.7822 1627.2695 2938.4632 2966.3234 2967.4906 3006.3982 3041.8144 3061.4281 3099.8764 3118.3784 3121.5328 3134.4538 3156.9049 3198.5433 3551.0155
redmass: 3.6334 4.1197 2.8395 1.8931 4.0385 3.3704 1.9719 1.2132 1.2018 4.3690 5.8008 3.0418 4.0787 3.8397 5.8814 5.0423 4.3802 4.6930 3.4836 3.5255 5.6686 1.5450 3.6643 3.7852 4.2991 7.2111 10.0387 3.6009 5.1810 1.5009 2.5426 2.4500 5.5250 8.7487 1.3177 2.7344 2.8534 1.4229 1.2356 1.2377 1.3167 1.3274 1.3388 2.3912 2.1182 1.6059 4.6287 2.6069 3.4417 3.7701 4.6273 1.1499 1.2363 1.1793 1.0546 1.0572 1.2026 1.0445 2.2896 1.0484 1.2409 2.1002 4.9593 6.2456 4.5833 1.0385 1.0317 1.0364 1.1020 1.1025 1.1038 1.0941 1.0964 1.1014 1.0921 1.0908 1.0949 1.0755
irintensity: 3.4683 0.7243 6.1601 9.3384 0.5606 1.6521 1.1599 0.5725 0.0913 1.9157 0.1657 4.1532 3.4471 2.3911 1.5597 14.3821 11.2139 3.8721 9.4321 2.9272 11.2438 71.7806 25.7526 3.0903 0.9687 13.3720 21.4262 1.6588 7.2510 2.2378 38.1448 42.7908 34.8391 72.3930 1.8632 34.5506 22.0689 20.5584 0.0322 6.0893 9.0976 0.1995 0.9572 263.2895 185.8057 4.6633 11.1488 12.9948 9.1254 268.2372 26.8871 35.3197 35.7997 28.7370 13.5429 35.5710 19.2428 27.1048 231.1691 10.8443 225.1853 368.0271 91.1129 45.8814 273.5778 51.5820 97.4987 82.4712 39.2503 43.5698 33.2596 17.8780 0.7930 29.7790 7.9543 4.5502 10.5233 13.2553
temp: 298.150 k
press: 1.00000 atm
elementType: 17 8 8 7 7 6 6 6 6 6 6 6 6 6 6 1 1 1 1 1 1 1 1 1 1 1 1 1
symmnumber: 1
zpe: 571668.4 jmol-1
zpe.correction: 0.217737 hartree
zpe.thermalcorrener: 0.234012 hartree
zpe.thermalcorrenthalpy: 0.234956 hartree
zpe.thermalcorrgfe: 0.172623 hartree
zpe.sumelectzpe: -1107.736711 hartree
zpe.sumelectthermal: -1107.720436 hartree
zpe.sumelectthermalent: -1107.719492 hartree
zpe.sumelectthermalfe: -1107.781825 hartree
dipole: -3.5680 3.3444 1.9913
dipole: 5.2803
quadrupole: -78.0364 -93.7162 -98.6828
quadrupole: -16.9522 6.8462 -1.1599
quadrupole: 12.1087 -3.5710 -8.5377 -16.9522 6.8462 -1.1599
hfenergy: -1107.9544483 hartree
pointgroup: C01 [X(C10H13Cl1N2O2)]
dipole: -1.4641357 1.2324873 0.8080391 debye
polarizability: 229.8739019|1.6618637|141.4010608|2.7047736|4.6205133|72.5320083 unknown
InChI: InChI=1S/C10H13ClN2O2/c1-13(2)10(14)12-7-4-5-9(15-3)8(11)6-7/h4-6,12H,1-3H3
charge 0 multiplicity 1
28 atoms
Cl 3.345421 2.239429 0.044023
O  3.999635 -0.795846 -0.329709
O  -2.561616 -1.653877 -0.106167
N  -1.532883 0.463752 0.040692
N  -3.884929 0.270326 0.086063
C  -0.163586 0.092529 -0.033731
C  0.792012 1.14299 0.04974
C  0.288186 -1.245574 -0.195021
C  -2.652462 -0.390492 -0.000601
C  2.63659 -0.475096 -0.174415
C  2.163372 0.85085 -0.023157
C  1.670848 -1.505633 -0.259547
C  -5.113175 -0.540316 0.051303
C  -4.018255 1.730244 0.198475
C  4.802203 -0.769819 0.912835
H  -1.701916 1.465487 0.135429
H  0.471201 2.185045 0.161651
H  -0.445204 -2.049904 -0.26422
H  2.035293 -2.52934 -0.393942
H  -5.743357 -0.268362 -0.817266
H  -5.70278 -0.405098 0.9783
H  -4.820948 -1.597548 -0.036442
H  -5.088101 1.986367 0.249067
H  -3.598147 2.260785 -0.680972
H  -3.546537 2.127066 1.121354
H  5.820424 -1.052456 0.605689
H  4.408423 -1.503896 1.6424
H  4.812888 0.240388 1.36187
