program: Orca
programVersion: 4.2.1
elementType: Cl F F F O N N N C C C C C C C C C C C C C C C H H H H H H H H H H H H H H H
charge: 0
multiplicity: 1
keywords: wb97x-d3
keywords: def2-TZVPP
keywords: def2/J RIJCOSX GRIDX6 NOFINALGRIDX
keywords: grid4 nofinalgrid
keywords: scfconv7
keywords: smallprint printgap noloewdin
keywords: NOSOSCF
formula: C15H15ClF3N3O
InChI: InChI=1S/C15H15ClF3N3O/c1-2-7-23-9-14(22-6-5-20-10-22)21-13-4-3-11(16)8-12(13)15(17,18)19/h3-6,8,10H,2,7,9H2,1H3
38 atoms
Cl -5.3378 0.953716 0.784525
F  -0.116151 -0.333769 -1.990162
F  -0.784329 -2.308825 -1.460593
F  -2.040639 -1.029764 -2.640175
O  2.357502 1.974815 0.546936
N  2.518379 -0.822322 1.02617
N  0.264098 -0.883314 0.822632
N  3.949383 -2.480926 0.770401
C  1.28519 -0.16435 1.011455
C  1.306781 1.339844 1.205443
C  2.263023 1.956033 -0.867036
C  -1.031232 -0.389369 0.802493
C  3.451931 2.694198 -1.443741
C  -1.805565 -0.491822 -0.360703
C  -1.624923 0.11683 1.956893
C  -3.127653 -0.072211 -0.364467
C  3.732507 -0.373415 1.511276
C  3.402093 2.725926 -2.963625
C  2.721954 -2.107399 0.596603
C  -1.189072 -1.043019 -1.610536
C  -2.94472 0.530808 1.958812
C  -3.688535 0.435728 0.795112
C  4.589404 -1.410387 1.347006
H  1.411267 1.556246 2.272653
H  0.33404 1.740108 0.894861
H  1.324718 2.429009 -1.187439
H  2.254826 0.925329 -1.245767
H  3.472644 3.71471 -1.05229
H  4.373254 2.2066 -1.113882
H  -1.050403 0.173195 2.872324
H  -3.726543 -0.134908 -1.262168
H  3.882305 0.60382 1.932322
H  2.512816 3.245225 -3.325434
H  4.27074 3.243171 -3.371513
H  3.39319 1.719916 -3.387452
H  1.929076 -2.692003 0.159479
H  -3.383021 0.923303 2.866305
H  5.633795 -1.447499 1.613955
elementType: Cl F O N C H
totalener: -1579.97879686 hartree
nucrepener: 2151.77639219 hartree
electener: -3731.75518906 hartree
oneelecener: -6445.23497240 hartree
twoeener: 2713.47978335 hartree
cpcmener: -0.02344587 hartree
kineticenergy: 1574.91328505 hartree
xcener: -123.746802543506 hartree
chargesum: 0.0000000
charge: -0.086521 -0.175706 -0.174648 -0.178118 -0.368073 -0.024023 -0.307842 -0.373631 0.186430 0.015556 0.015383 0.116418 -0.074497 -0.172192 -0.174838 -0.078465 -0.119232 -0.277621 0.067695 0.551358 -0.108160 0.082383 -0.121472 0.152625 0.126267 0.096723 0.079649 0.062924 0.062934 0.157996 0.133827 0.172968 0.081869 0.094298 0.081671 0.163243 0.147313 0.165508
qa: -0.0865 -0.1757 -0.1746 -0.1781 -0.3681 -0.0240 -0.3078 -0.3736 0.1864 0.0156 0.0154 0.1164 -0.0745 -0.1722 -0.1748 -0.0785 -0.1192 -0.2776 0.0677 0.5514 -0.1082 0.0824 -0.1215 0.1526 0.1263 0.0967 0.0796 0.0629 0.0629 0.1580 0.1338 0.1730 0.0819 0.0943 0.0817 0.1632 0.1473 0.1655
va: 1.2169 1.1135 1.1243 1.1247 1.9399 3.2988 3.0006 3.1208 3.8455 3.9421 3.8858 3.9167 3.8973 3.8615 3.9897 3.9718 3.9063 3.9534 4.0233 4.4220 3.9885 3.8629 4.0287 0.9821 0.9962 0.9964 0.9905 1.0122 1.0114 0.9951 1.0238 1.0068 1.0019 1.0033 1.0011 1.0132 1.0022 1.0004
dispcorr: -0.019100086 hartree
energy: -1579.997896949266
dipole: 34.89230 -35.42235 -0.53005 19.19887 -16.97405 2.22483 1.56836 -0.51778 1.05058
magnitude: 2.51685 au
magnitude: 6.39732 debye
