program: Orca
programVersion: 4.2.1
elementType: Cl F F F O N N N C C C C C C C C C C C C C C C H H H H H H H H H H H H H H H
charge: 0
multiplicity: 1
keywords: wb97x-d3
keywords: def2-TZVPP
keywords: def2/J RIJCOSX GRIDX6 NOFINALGRIDX
keywords: grid4 nofinalgrid
keywords: scfconv7
keywords: smallprint printgap noloewdin
keywords: NOSOSCF
formula: C15H15ClF3N3O
InChI: InChI=1S/C15H15ClF3N3O/c1-2-7-23-9-14(22-6-5-20-10-22)21-13-4-3-11(16)8-12(13)15(17,18)19/h3-6,8,10H,2,7,9H2,1H3
38 atoms
Cl -5.373705 0.94907 0.840539
F  -0.287834 -0.610438 -2.049754
F  -0.857802 -2.496564 -1.185539
F  -2.224249 -1.441081 -2.459018
O  2.270517 2.105502 0.173418
N  2.530922 -0.611501 0.917729
N  0.273012 -0.742261 0.791638
N  4.005488 -2.241438 0.744397
C  1.280518 0.012796 0.894366
C  1.285926 1.527007 0.971712
C  2.013474 2.009145 -1.21727
C  -1.034017 -0.281699 0.78534
C  3.177319 2.600369 -1.980449
C  -1.868577 -0.560094 -0.305493
C  -1.579167 0.361491 1.894893
C  -3.199587 -0.170495 -0.289489
C  3.732257 -0.105306 1.374193
C  4.479621 1.836669 -1.79331
C  2.768109 -1.910094 0.553466
C  -1.310901 -1.277657 -1.497446
C  -2.908887 0.741515 1.919627
C  -3.710367 0.477314 0.82259
C  4.616977 -1.125462 1.263738
H  1.475162 1.831183 2.005422
H  0.285424 1.894141 0.713175
H  1.083769 2.539177 -1.462313
H  1.877645 0.962249 -1.520051
H  2.898983 2.601496 -3.037341
H  3.305691 3.649026 -1.697975
H  -0.958898 0.548841 2.761905
H  -3.846337 -0.36963 -1.13231
H  3.854904 0.89672 1.742737
H  4.363979 0.784951 -2.063697
H  5.267673 2.252152 -2.422977
H  4.831885 1.873109 -0.762563
H  1.990301 -2.537597 0.149512
H  -3.309364 1.239386 2.792215
H  5.66235 -1.120042 1.52985
elementType: Cl F O N C H
totalener: -1579.97858323 hartree
nucrepener: 2161.16260475 hartree
electener: -3741.14118798 hartree
oneelecener: -6464.04015792 hartree
twoeener: 2722.89896994 hartree
cpcmener: -0.02373404 hartree
kineticenergy: 1574.92286614 hartree
xcener: -123.748830640653 hartree
chargesum: 0.0000000
charge: -0.086355 -0.175892 -0.174677 -0.178433 -0.363827 -0.002730 -0.305001 -0.372568 0.179660 0.011132 -0.002781 0.145274 -0.095336 -0.180822 -0.191339 -0.076878 -0.135696 -0.255207 0.060441 0.552413 -0.108343 0.082023 -0.115544 0.152037 0.127160 0.103432 0.083483 0.065844 0.063127 0.160226 0.133886 0.171718 0.075506 0.102464 0.076279 0.163207 0.147277 0.164842
qa: -0.0864 -0.1759 -0.1747 -0.1784 -0.3638 -0.0027 -0.3050 -0.3726 0.1797 0.0111 -0.0028 0.1453 -0.0953 -0.1808 -0.1913 -0.0769 -0.1357 -0.2552 0.0604 0.5524 -0.1083 0.0820 -0.1155 0.1520 0.1272 0.1034 0.0835 0.0658 0.0631 0.1602 0.1339 0.1717 0.0755 0.1025 0.0763 0.1632 0.1473 0.1648
va: 1.2172 1.1146 1.1239 1.1241 1.9369 3.2898 2.9981 3.1194 3.8402 3.9381 3.9081 3.8850 3.9232 3.8629 3.9885 3.9683 3.9156 3.9048 4.0291 4.4206 3.9874 3.8667 4.0250 0.9821 0.9948 1.0001 0.9920 1.0117 1.0150 0.9937 1.0237 1.0023 1.0044 1.0032 1.0120 1.0132 1.0024 1.0012
dispcorr: -0.020027881 hartree
energy: -1579.998611109292
dipole: 37.43333 -38.04441 -0.61107 19.01719 -16.64067 2.37652 1.99083 -1.09879 0.89204
magnitude: 2.61094 au
magnitude: 6.63647 debye
