program: Orca
programVersion: 4.2.1
elementType: Cl F F F O N N N C C C C C C C C C C C C C C C H H H H H H H H H H H H H H H
charge: 0
multiplicity: 1
keywords: wb97x-d3
keywords: def2-TZVPP
keywords: def2/J RIJCOSX GRIDX6 NOFINALGRIDX
keywords: grid4 nofinalgrid
keywords: scfconv7
keywords: smallprint printgap noloewdin
keywords: NOSOSCF
formula: C15H15ClF3N3O
InChI: InChI=1S/C15H15ClF3N3O/c1-2-7-23-9-14(22-6-5-20-10-22)21-13-4-3-11(16)8-12(13)15(17,18)19/h3-6,8,10H,2,7,9H2,1H3
38 atoms
Cl -4.454323 1.901778 0.858696
F  -1.908937 -1.148525 -2.411077
F  0.152703 -0.695691 -2.013037
F  -0.745665 -2.455798 -1.165854
O  1.171266 1.507178 0.051703
N  2.814776 -1.650751 0.683369
N  0.637566 -1.06929 0.917819
N  4.813496 -2.587873 0.574012
C  1.785111 -0.714365 0.55208
C  2.213197 0.608457 -0.044329
C  1.2579 2.616165 -0.810931
C  -0.531845 -0.328042 0.860693
C  -0.0014 3.444595 -0.666126
C  -1.378962 -0.38286 -0.250717
C  -0.948339 0.383951 1.98285
C  -2.58469 0.306039 -0.245486
C  2.676235 -2.933914 1.170333
C  0.021488 4.660994 -1.579824
C  4.136934 -1.513275 0.338247
C  -0.975367 -1.174599 -1.456886
C  -2.144959 1.070912 1.987579
C  -2.958402 1.037207 0.866007
C  3.913163 -3.482878 1.093543
H  2.514696 0.423023 -1.087284
H  3.109485 0.968574 0.48329
H  1.370861 2.280571 -1.852413
H  2.142284 3.225618 -0.573258
H  -0.867238 2.818028 -0.89214
H  -0.108316 3.758636 0.374544
H  -0.311029 0.403406 2.856057
H  -3.239094 0.277113 -1.104741
H  1.727398 -3.309129 1.50758
H  0.857819 5.322469 -1.348503
H  0.108352 4.373404 -2.628668
H  -0.892893 5.243242 -1.476784
H  4.544343 -0.607667 -0.082472
H  -2.445004 1.632218 2.861609
H  4.212845 -4.47663 1.383775
totalener: -1579.95414405 hartree
nucrepener: 2195.48882078 hartree
electener: -3775.44296483 hartree
oneelecener: -6533.01916016 hartree
twoeener: 2757.57619533 hartree
kineticenergy: 1574.95804131 hartree
xcener: -123.756474491918 hartree
chargesum: 0.0000000
charge: -0.078165 -0.172013 -0.183579 -0.162318 -0.297276 -0.043353 -0.312241 -0.293187 0.248491 -0.047085 0.012438 0.216671 -0.088952 -0.188499 -0.161515 -0.118157 -0.094373 -0.258816 0.033741 0.560953 -0.108870 0.083325 -0.078032 0.109232 0.110986 0.073522 0.072846 0.065328 0.067401 0.112677 0.124603 0.165346 0.077164 0.077397 0.092704 0.128316 0.121488 0.131802
qa: -0.0782 -0.1720 -0.1836 -0.1623 -0.2973 -0.0434 -0.3122 -0.2932 0.2485 -0.0471 0.0124 0.2167 -0.0890 -0.1885 -0.1615 -0.1182 -0.0944 -0.2588 0.0337 0.5610 -0.1089 0.0833 -0.0780 0.1092 0.1110 0.0735 0.0728 0.0653 0.0674 0.1127 0.1246 0.1653 0.0772 0.0774 0.0927 0.1283 0.1215 0.1318
va: 1.2261 1.1337 1.1045 1.1425 1.9846 3.3436 3.0386 3.1449 3.8754 4.0079 3.9239 3.8925 3.9188 3.8442 4.0569 3.9369 3.8801 3.9667 4.0802 4.4156 4.0044 3.8689 4.0346 0.9849 0.9909 0.9966 0.9907 1.0079 1.0100 1.0137 1.0284 1.0141 1.0035 1.0026 1.0055 1.0026 1.0108 1.0074
dispcorr: -0.020062815 hartree
energy: -1579.974206862339
dipole: 20.42140 -20.24059 0.18080 22.34128 -20.94214 1.39914 2.57059 -2.34993 0.22066
magnitude: 1.42793 au
magnitude: 3.62950 debye
