program: Orca
programVersion: 4.2.1
elementType: Cl F F F O N N N C C C C C C C C C C C C C C C H H H H H H H H H H H H H H H
charge: 0
multiplicity: 1
keywords: wb97x-d3
keywords: def2-TZVPP
keywords: def2/J RIJCOSX GRIDX6 NOFINALGRIDX
keywords: grid4 nofinalgrid
keywords: scfconv7
keywords: smallprint printgap noloewdin
keywords: NOSOSCF
formula: C15H15ClF3N3O
InChI: InChI=1S/C15H15ClF3N3O/c1-2-7-23-9-14(22-6-5-20-10-22)21-13-4-3-11(16)8-12(13)15(17,18)19/h3-6,8,10H,2,7,9H2,1H3
38 atoms
Cl -4.960719 1.616693 -0.529216
F  -0.881056 -2.67324 0.470615
F  -0.061818 -1.152008 1.75358
F  -2.090716 -1.803664 2.016962
O  2.664737 1.876683 0.270496
N  2.747671 -0.644874 -1.1233
N  0.488437 -0.580469 -0.998425
N  4.867306 -1.120865 -1.525368
C  1.56926 0.07363 -0.949936
C  1.714494 1.565778 -0.697608
C  2.381519 1.413341 1.578671
C  -0.768384 -0.019119 -0.87265
C  1.198182 2.096213 2.246639
C  -1.632727 -0.471814 0.134294
C  -1.249875 0.917522 -1.786534
C  -2.915845 0.041679 0.239685
C  2.835138 -2.022155 -1.204053
C  1.058335 1.647139 3.695131
C  4.022432 -0.165275 -1.328374
C  -1.165783 -1.529326 1.092794
C  -2.534163 1.421275 -1.690277
C  -3.360796 0.98802 -0.668546
C  4.141423 -2.284127 -1.444221
H  0.725377 1.970009 -0.461352
H  2.036463 2.053394 -1.623034
H  3.289232 1.613066 2.150579
H  2.238645 0.324704 1.588909
H  1.335461 3.179313 2.200765
H  0.267812 1.873079 1.71713
H  -0.612395 1.235737 -2.60152
H  -3.581083 -0.293007 1.022307
H  1.972092 -2.650189 -1.076502
H  1.953864 1.878043 4.273806
H  0.21876 2.143618 4.179467
H  0.886764 0.572872 3.7647
H  4.263621 0.884159 -1.311321
H  -2.888576 2.146858 -2.409224
H  4.610681 -3.247271 -1.563092
totalener: -1579.95548330 hartree
nucrepener: 2186.45010627 hartree
electener: -3766.40558957 hartree
oneelecener: -6514.46294358 hartree
twoeener: 2748.05735402 hartree
kineticenergy: 1574.94870147 hartree
xcener: -123.754316935696 hartree
chargesum: -0.0000000
charge: -0.065103 -0.159750 -0.175459 -0.172608 -0.333263 -0.040602 -0.284816 -0.293736 0.169046 -0.028439 0.012372 0.139097 -0.112582 -0.191403 -0.184184 -0.078960 -0.107810 -0.256383 0.049470 0.560632 -0.099805 0.076394 -0.077897 0.119462 0.133981 0.106104 0.077753 0.080094 0.050184 0.140806 0.130558 0.164573 0.079567 0.088957 0.084018 0.140681 0.127761 0.131292
qa: -0.0651 -0.1598 -0.1755 -0.1726 -0.3333 -0.0406 -0.2848 -0.2937 0.1690 -0.0284 0.0124 0.1391 -0.1126 -0.1914 -0.1842 -0.0790 -0.1078 -0.2564 0.0495 0.5606 -0.0998 0.0764 -0.0779 0.1195 0.1340 0.1061 0.0778 0.0801 0.0502 0.1408 0.1306 0.1646 0.0796 0.0890 0.0840 0.1407 0.1278 0.1313
va: 1.2400 1.1465 1.1141 1.1318 1.9712 3.3285 2.9901 3.1428 3.8275 3.9795 3.9063 3.9043 3.8709 3.8564 3.9570 3.9630 3.8910 3.9441 4.0556 4.4056 4.0173 3.9433 4.0419 0.9881 0.9846 0.9965 0.9982 1.0139 1.0100 0.9985 1.0251 1.0122 1.0048 1.0046 1.0094 1.0119 1.0095 1.0078
dispcorr: -0.020517101 hartree
energy: -1579.976000400401
dipole: 25.14795 -25.92798 -0.78003 15.74136 -14.65899 1.08236 5.85979 -5.90482 -0.04503
magnitude: 1.33491 au
magnitude: 3.39308 debye
