program: Orca
programVersion: 4.2.1
elementType: Cl F F F O N N N C C C C C C C C C C C C C C C H H H H H H H H H H H H H H H
charge: 0
multiplicity: 1
keywords: wb97x-d3
keywords: def2-TZVPP
keywords: def2/J RIJCOSX GRIDX6 NOFINALGRIDX
keywords: grid4 nofinalgrid
keywords: scfconv7
keywords: smallprint printgap noloewdin
keywords: NOSOSCF
formula: C15H15ClF3N3O
InChI: InChI=1S/C15H15ClF3N3O/c1-2-7-23-9-14(22-6-5-20-10-22)21-13-4-3-11(16)8-12(13)15(17,18)19/h3-6,8,10H,2,7,9H2,1H3
38 atoms
Cl -5.334725 0.963724 0.745324
F  -0.085269 -0.293714 -1.919905
F  -0.712431 -2.293459 -1.429878
F  -1.982016 -1.029239 -2.615305
O  2.084023 1.519571 -0.464686
N  2.494638 -0.896192 0.940465
N  0.227224 -0.984365 0.944334
N  3.929321 -2.564996 1.12856
C  1.259265 -0.265939 0.839478
C  1.281693 1.229586 0.633913
C  2.136961 2.89318 -0.77257
C  -1.061854 -0.478139 0.866425
C  3.088949 3.10438 -1.93083
C  -1.79352 -0.520643 -0.326465
C  -1.68561 0.00425 2.014808
C  -3.107024 -0.074874 -0.356782
C  3.748439 -0.328085 1.078671
C  4.518013 2.676193 -1.627956
C  2.684171 -2.257157 0.980803
C  -1.143431 -1.040571 -1.575487
C  -2.994027 0.450004 1.984951
C  -3.701125 0.409983 0.795301
C  4.603706 -1.371778 1.196025
H  1.655892 1.708749 1.554305
H  0.252604 1.583167 0.496086
H  2.477292 3.468811 0.102724
H  1.134987 3.264598 -1.02989
H  2.712748 2.570398 -2.806631
H  3.063662 4.167125 -2.184774
H  -1.134722 0.011728 2.946024
H  -3.675189 -0.100344 -1.275377
H  3.92116 0.73193 1.068868
H  4.58622 1.604591 -1.444674
H  5.178645 2.908728 -2.462688
H  4.908856 3.193947 -0.7494
H  1.858052 -2.942575 0.887253
H  -3.461345 0.823757 2.885538
H  5.673656 -1.334817 1.322385
totalener: -1579.95524547 hartree
nucrepener: 2150.42786938 hartree
electener: -3730.38311485 hartree
oneelecener: -6442.73062895 hartree
twoeener: 2712.34751410 hartree
kineticenergy: 1574.95058198 hartree
xcener: -123.749745992677 hartree
chargesum: 0.0000000
charge: -0.068966 -0.167330 -0.161026 -0.172122 -0.312647 -0.028587 -0.284184 -0.293791 0.211235 -0.016881 -0.000095 0.058726 -0.092879 -0.160431 -0.161061 -0.088875 -0.108528 -0.257823 0.060249 0.560795 -0.101509 0.079526 -0.088601 0.122050 0.118309 0.071736 0.084326 0.071083 0.057604 0.132237 0.131503 0.144490 0.094157 0.092564 0.067309 0.150805 0.127056 0.129578
qa: -0.0690 -0.1673 -0.1610 -0.1721 -0.3126 -0.0286 -0.2842 -0.2938 0.2112 -0.0169 -0.0001 0.0587 -0.0929 -0.1604 -0.1611 -0.0889 -0.1085 -0.2578 0.0602 0.5608 -0.1015 0.0795 -0.0886 0.1221 0.1183 0.0717 0.0843 0.0711 0.0576 0.1322 0.1315 0.1445 0.0942 0.0926 0.0673 0.1508 0.1271 0.1296
va: 1.2355 1.1319 1.1453 1.1325 1.9619 3.3300 3.0139 3.1374 3.9631 3.9534 3.9181 4.0404 3.9262 3.8776 4.0014 3.9746 3.9098 3.9261 4.0291 4.4193 4.0133 3.9227 4.0595 0.9889 1.0006 0.9892 0.9981 1.0143 1.0113 1.0083 1.0257 1.0054 1.0065 1.0094 1.0024 1.0149 1.0098 1.0079
dispcorr: -0.018684713 hartree
energy: -1579.973930182105
dipole: 36.92101 -37.06904 -0.14803 22.30225 -20.17212 2.13012 4.09585 -3.48653 0.60931
magnitude: 2.22049 au
magnitude: 5.64405 debye
