program: Orca
programVersion: 4.2.1
elementType: Cl F F F O N N N C C C C C C C C C C C C C C C H H H H H H H H H H H H H H H
charge: 0
multiplicity: 1
keywords: wb97x-d3
keywords: def2-TZVPP
keywords: def2/J RIJCOSX GRIDX6 NOFINALGRIDX
keywords: grid4 nofinalgrid
keywords: scfconv7
keywords: smallprint printgap noloewdin
keywords: NOSOSCF
formula: C15H15ClF3N3O
InChI: InChI=1S/C15H15ClF3N3O/c1-2-7-23-9-14(22-6-5-20-10-22)21-13-4-3-11(16)8-12(13)15(17,18)19/h3-6,8,10H,2,7,9H2,1H3
38 atoms
Cl -5.247638 0.992411 0.776617
F  0.089941 0.056934 -1.847602
F  -0.608951 -1.975887 -1.747072
F  -1.79017 -0.481095 -2.740193
O  2.234378 1.488733 -0.058638
N  2.514582 -1.135844 0.97418
N  0.248663 -1.141856 0.865271
N  3.881847 -2.870451 1.014504
C  1.304916 -0.452886 0.915395
C  1.37555 1.055193 0.946425
C  2.264977 2.890069 -0.205307
C  -1.021745 -0.587413 0.819895
C  3.17104 3.244912 -1.365586
C  -1.695936 -0.391557 -0.391589
C  -1.688929 -0.298459 2.008414
C  -2.995048 0.096025 -0.397403
C  3.780629 -0.637958 1.226801
C  2.688576 2.696122 -2.700871
C  2.655392 -2.498903 0.858969
C  -1.001797 -0.703923 -1.685278
C  -2.982749 0.188387 2.00317
C  -3.631963 0.386377 0.796303
C  4.593428 -1.720802 1.250395
H  1.715293 1.374913 1.945818
H  0.36277 1.456255 0.819052
H  2.625136 3.364976 0.719296
H  1.250627 3.274479 -0.388972
H  3.234471 4.335189 -1.410226
H  4.18237 2.888639 -1.153775
H  -1.183454 -0.475886 2.948454
H  -3.519128 0.25364 -1.328907
H  3.990103 0.408776 1.342744
H  3.357947 2.99471 -3.507095
H  2.641583 1.608664 -2.694043
H  1.6929 3.070007 -2.944998
H  1.810646 -3.136118 0.655795
H  -3.483959 0.40945 2.935365
H  5.658135 -1.741048 1.417901
totalener: -1579.95512468 hartree
nucrepener: 2160.57710396 hartree
electener: -3740.53222864 hartree
oneelecener: -6463.05988471 hartree
twoeener: 2722.52765607 hartree
kineticenergy: 1574.95055533 hartree
xcener: -123.749698543812 hartree
chargesum: 0.0000000
charge: -0.068717 -0.166600 -0.160541 -0.171902 -0.316338 -0.034235 -0.286019 -0.293698 0.211515 -0.012408 0.003561 0.060724 -0.103606 -0.164688 -0.158226 -0.089263 -0.099120 -0.238905 0.057809 0.563604 -0.103358 0.080366 -0.088667 0.122376 0.115532 0.079610 0.077277 0.059092 0.062530 0.132039 0.131050 0.141394 0.087301 0.094453 0.068080 0.151353 0.127136 0.129490
qa: -0.0687 -0.1666 -0.1605 -0.1719 -0.3163 -0.0342 -0.2860 -0.2937 0.2115 -0.0124 0.0036 0.0607 -0.1036 -0.1647 -0.1582 -0.0893 -0.0991 -0.2389 0.0578 0.5636 -0.1034 0.0804 -0.0887 0.1224 0.1155 0.0796 0.0773 0.0591 0.0625 0.1320 0.1311 0.1414 0.0873 0.0945 0.0681 0.1514 0.1271 0.1295
va: 1.2360 1.1320 1.1463 1.1329 1.9577 3.3375 3.0092 3.1362 3.9723 3.9470 3.9094 4.0366 3.9497 3.8725 3.9998 3.9770 3.9090 3.9241 4.0290 4.4095 4.0133 3.9224 4.0549 0.9889 1.0010 0.9950 0.9926 1.0110 1.0130 1.0088 1.0261 1.0126 1.0060 1.0136 1.0059 1.0150 1.0098 1.0077
dispcorr: -0.018621102 hartree
energy: -1579.973745783995
dipole: 31.93015 -32.08424 -0.15410 19.70821 -17.72519 1.98302 4.39480 -3.50768 0.88711
magnitude: 2.17786 au
magnitude: 5.53568 debye
