program: Orca
programVersion: 4.2.1
elementType: Cl F F F O N N N C C C C C C C C C C C C C C C H H H H H H H H H H H H H H H
charge: 0
multiplicity: 1
keywords: wb97x-d3
keywords: def2-TZVPP
keywords: def2/J RIJCOSX GRIDX6 NOFINALGRIDX
keywords: grid4 nofinalgrid
keywords: scfconv7
keywords: smallprint printgap noloewdin
keywords: NOSOSCF
formula: C15H15ClF3N3O
InChI: InChI=1S/C15H15ClF3N3O/c1-2-7-23-9-14(22-6-5-20-10-22)21-13-4-3-11(16)8-12(13)15(17,18)19/h3-6,8,10H,2,7,9H2,1H3
38 atoms
Cl -5.18947 1.284219 0.636387
F  0.075328 -0.18361 -1.910503
F  -0.736637 -2.15116 -1.590081
F  -1.841921 -0.70512 -2.731224
O  2.306229 1.393797 -0.235632
N  2.476823 -1.146441 1.000026
N  0.213325 -1.063283 0.898481
N  4.604089 -1.645762 1.325002
C  1.297791 -0.41823 0.894579
C  1.436157 1.083122 0.805427
C  2.476896 2.778918 -0.425745
C  -1.031858 -0.458571 0.812144
C  3.453364 3.007719 -1.55996
C  -1.716706 -0.372164 -0.406069
C  -1.665906 -0.006162 1.967024
C  -2.994437 0.166021 -0.453121
C  2.565941 -2.52512 0.982954
C  3.673364 4.491612 -1.816206
C  3.754333 -0.681394 1.210282
C  -1.055009 -0.858639 -1.662551
C  -2.938893 0.531755 1.920692
C  -3.599696 0.616714 0.707088
C  3.876902 -2.801608 1.178059
H  1.800071 1.466674 1.773379
H  0.441379 1.518846 0.652413
H  2.851773 3.250554 0.496117
H  1.512397 3.255979 -0.654671
H  4.40311 2.523811 -1.320547
H  3.073661 2.522705 -2.461828
H  -1.153239 -0.095875 2.915628
H  -3.526348 0.238737 -1.390662
H  1.701241 -3.144718 0.829945
H  2.745164 4.992932 -2.094647
H  4.070382 4.997741 -0.93475
H  4.383238 4.646738 -2.627391
H  3.994657 0.366802 1.261756
H  -3.41483 0.880318 2.826809
H  4.347904 -3.770237 1.220795
totalener: -1579.95611360 hartree
nucrepener: 2134.80691939 hartree
electener: -3714.76303299 hartree
oneelecener: -6411.49000558 hartree
twoeener: 2696.72697260 hartree
kineticenergy: 1574.95133240 hartree
xcener: -123.749780895675 hartree
chargesum: -0.0000000
charge: -0.069012 -0.167231 -0.161489 -0.172411 -0.313572 -0.040342 -0.281752 -0.297297 0.212846 -0.024709 0.023238 0.058065 -0.084659 -0.158348 -0.162488 -0.086937 -0.099406 -0.257526 0.063296 0.558649 -0.102392 0.079137 -0.080145 0.124410 0.118143 0.062904 0.071334 0.065055 0.070148 0.132853 0.131275 0.164152 0.076460 0.073840 0.092684 0.123489 0.127078 0.130658
qa: -0.0690 -0.1672 -0.1615 -0.1724 -0.3136 -0.0403 -0.2818 -0.2973 0.2128 -0.0247 0.0232 0.0581 -0.0847 -0.1583 -0.1625 -0.0869 -0.0994 -0.2575 0.0633 0.5586 -0.1024 0.0791 -0.0801 0.1244 0.1181 0.0629 0.0713 0.0651 0.0701 0.1329 0.1313 0.1642 0.0765 0.0738 0.0927 0.1235 0.1271 0.1307
va: 1.2356 1.1322 1.1444 1.1319 1.9711 3.3416 3.0121 3.1435 3.9566 3.9716 3.9145 4.0412 3.9179 3.8745 4.0033 3.9739 3.8868 3.9455 4.0727 4.4231 4.0141 3.9240 4.0398 0.9876 1.0008 0.9920 0.9950 1.0120 1.0137 1.0079 1.0258 1.0133 1.0031 1.0031 1.0059 1.0114 1.0098 1.0077
dispcorr: -0.017816725 hartree
energy: -1579.973930321135
dipole: 34.17133 -34.62491 -0.45358 22.28182 -20.87301 1.40880 5.51295 -4.86885 0.64410
magnitude: 1.61410 au
magnitude: 4.10273 debye
